program: Orca
programVersion: 5.0.2
elementType: O O O C C C C C C C C C C C C C C C C C C C H H H H H H H H H H H H H H H H H H H H H H H H H H
charge: 0
multiplicity: 1
keywords: wb97x-d3
keywords: def2-TZVPP
keywords: def2/J RIJCOSX
keywords: DEFGRID2
keywords: scfconv7
keywords: smallprint printgap noloewdin
keywords: NOSOSCF
formula: C19H26O3
InChI: InChI=1/C19H26O3/c1-7-8-13-12(4)16(10-15(13)20)22-18(21)17-14(9-11(2)3)19(17,5)6/h7-9,14,16-17H,10H2,1-6H3
48 atoms
O  -0.101816 -0.323162 0.014819
O  0.903552 0.562767 -1.782689
O  -3.956325 -2.849166 0.156641
C  2.745867 1.844245 0.417436
C  3.440525 0.691159 -0.218711
C  2.034071 0.500362 0.32474
C  3.138022 2.260895 1.814365
C  2.310965 3.005635 -0.44302
C  4.587133 -0.006633 0.417025
C  0.920786 0.270325 -0.610458
C  4.953302 -1.264283 0.155294
C  -1.292537 -0.637772 -0.709808
C  6.150615 -1.880888 0.810755
C  4.219049 -2.154118 -0.799161
C  -1.737108 -2.063155 -0.419462
C  -2.431345 0.235117 -0.241728
C  -3.519435 -0.49793 0.071065
C  -3.189825 -1.930061 -0.035149
C  -2.277891 1.708824 -0.213733
C  -4.849057 -0.073218 0.489958
C  -5.492597 1.013779 0.058786
C  -6.851218 1.421392 0.511407
H  3.474689 0.734538 -1.304475
H  1.94985 -0.0341 1.264139
H  3.386674 1.414419 2.454609
H  4.0039 2.926104 1.789572
H  2.32129 2.804555 2.293216
H  2.131335 2.73085 -1.479841
H  1.401116 3.467212 -0.05317
H  3.089976 3.770821 -0.441702
H  5.181652 0.56588 1.123345
H  -1.128528 -0.480993 -1.778403
H  6.880702 -2.209769 0.066237
H  6.651105 -1.189715 1.489068
H  5.871502 -2.770803 1.381265
H  3.938392 -3.091938 -0.313917
H  3.312981 -1.704253 -1.201087
H  4.857217 -2.426875 -1.643385
H  -1.180836 -2.489025 0.419215
H  -1.615717 -2.737385 -1.26773
H  -3.047577 2.188611 0.387919
H  -2.339693 2.120458 -1.224656
H  -1.305257 2.000589 0.185064
H  -5.352254 -0.729841 1.194759
H  -5.027896 1.651873 -0.686785
H  -7.542531 1.483688 -0.332183
H  -7.266387 0.726643 1.241307
H  -6.829226 2.416091 0.963008
elementType: O C H
totalener: -965.43514809 hartree
nucrepener: 1776.03606429 hartree
electener: -2741.47121239 hartree
oneelecener: -4838.29668520 hartree
twoeener: 2096.82547281 hartree
cpcmener: -0.02775017 hartree
kineticenergy: 960.99692573 hartree
xcener: -95.142358650095 hartree
chargesum: -0.0000000
charge: -0.296347 -0.472084 -0.445461 0.152138 -0.042716 -0.080970 -0.290686 -0.275168 -0.280693 0.370796 -0.012531 0.276245 -0.226581 -0.245158 -0.143377 -0.063411 0.000724 0.278828 -0.274384 -0.235738 -0.092327 -0.214874 0.103913 0.090459 0.091894 0.099742 0.097445 0.094926 0.094528 0.097543 0.122610 0.102269 0.094322 0.088837 0.094444 0.095305 0.079901 0.101508 0.100010 0.100105 0.112456 0.122205 0.106246 0.116573 0.129821 0.096401 0.086129 0.094182
qa: -0.2963 -0.4721 -0.4455 0.1521 -0.0427 -0.0810 -0.2907 -0.2752 -0.2807 0.3708 -0.0125 0.2762 -0.2266 -0.2452 -0.1434 -0.0634 0.0007 0.2788 -0.2744 -0.2357 -0.0923 -0.2149 0.1039 0.0905 0.0919 0.0997 0.0974 0.0949 0.0945 0.0975 0.1226 0.1023 0.0943 0.0888 0.0944 0.0953 0.0799 0.1015 0.1000 0.1001 0.1125 0.1222 0.1062 0.1166 0.1298 0.0964 0.0861 0.0942
va: 2.1162 2.0313 2.0572 3.7081 3.8405 3.8038 3.9121 3.8831 3.8811 4.1720 3.7061 3.7165 3.9291 3.9425 3.9261 3.7874 3.4429 4.0850 3.9419 3.8710 3.8627 3.9517 1.0248 1.0339 1.0015 0.9989 1.0028 1.0180 1.0013 1.0019 1.0029 1.0347 0.9959 1.0068 0.9969 0.9991 1.0144 0.9985 1.0282 1.0242 1.0004 0.9929 1.0082 1.0236 1.0000 0.9961 1.0087 0.9969
dispcorr: -0.021909848 hartree
energy: -965.457057941079
dipole: 14.80686 -13.70989 1.09697 10.50523 -8.90093 1.60430 4.59722 -4.07440 0.52282
magnitude: 2.01258 au
magnitude: 5.11556 debye
