program: Orca
programVersion: 5.0.2
elementType: O O O C C C C C C C C C C C C C C C C C C C H H H H H H H H H H H H H H H H H H H H H H H H H H
charge: 0
multiplicity: 1
keywords: wb97x-d3
keywords: def2-TZVPP
keywords: def2/J RIJCOSX
keywords: DEFGRID2
keywords: scfconv7
keywords: smallprint printgap noloewdin
keywords: NOSOSCF
formula: C19H26O3
InChI: InChI=1/C19H26O3/c1-7-8-13-12(4)16(10-15(13)20)22-18(21)17-14(9-11(2)3)19(17,5)6/h7-9,14,16-17H,10H2,1-6H3
48 atoms
O  -0.124496 -0.334943 0.052507
O  0.905708 0.506049 -1.75277
O  -4.00146 -2.838806 0.181938
C  2.730806 1.820951 0.447602
C  3.426307 0.657159 -0.168369
C  2.013568 0.479738 0.367696
C  3.110018 2.256888 1.842242
C  2.310581 2.971939 -0.433793
C  4.566866 -0.038925 0.476493
C  0.908121 0.238856 -0.574343
C  5.019029 -1.243591 0.117517
C  -1.308322 -0.662652 -0.67753
C  6.217297 -1.855806 0.774715
C  4.389793 -2.066716 -0.964496
C  -1.763687 -2.077152 -0.353133
C  -2.449327 0.227601 -0.248543
C  -3.547179 -0.492217 0.062344
C  -3.224736 -1.928166 -0.009575
C  -2.291448 1.701264 -0.254849
C  -4.880803 -0.053528 0.451513
C  -5.501126 1.047679 0.021325
C  -6.864081 1.465213 0.451092
H  3.465583 0.686998 -1.253988
H  1.919909 -0.040254 1.314243
H  2.292334 2.815892 2.301345
H  3.341571 1.419378 2.500239
H  3.982476 2.913354 1.817333
H  2.138213 2.682961 -1.468049
H  1.400483 3.444976 -0.058601
H  3.094679 3.731934 -0.436847
H  5.084665 0.488346 1.272382
H  -1.130704 -0.536643 -1.748128
H  6.648791 -1.204948 1.53531
H  5.963229 -2.80765 1.248731
H  6.996968 -2.076814 0.040529
H  5.030545 -2.100114 -1.850402
H  4.262605 -3.101936 -0.638684
H  3.414271 -1.69503 -1.275484
H  -1.231477 -2.473182 0.515501
H  -1.620091 -2.780898 -1.173408
H  -1.307149 2.001301 0.106988
H  -3.042294 2.193698 0.36097
H  -2.386699 2.092454 -1.271469
H  -5.410586 -0.712702 1.134148
H  -5.012925 1.6916 -0.70374
H  -7.53202 1.565308 -0.407619
H  -7.309441 0.756281 1.149157
H  -6.836857 2.445477 0.933543
elementType: O C H
totalener: -965.43511944 hartree
nucrepener: 1772.94941163 hartree
electener: -2738.38453108 hartree
oneelecener: -4832.13016484 hartree
twoeener: 2093.74563377 hartree
cpcmener: -0.02782472 hartree
kineticenergy: 960.99196728 hartree
xcener: -95.141615018791 hartree
chargesum: -0.0000000
charge: -0.295981 -0.472298 -0.445777 0.151795 -0.051984 -0.070357 -0.292993 -0.273074 -0.274302 0.368740 -0.012026 0.278299 -0.225744 -0.254072 -0.143418 -0.059891 -0.003795 0.279798 -0.277149 -0.235188 -0.090949 -0.214414 0.102521 0.090093 0.098222 0.089972 0.101132 0.094980 0.094351 0.097956 0.123498 0.101802 0.087802 0.094968 0.094109 0.103507 0.093777 0.082416 0.100283 0.099681 0.105496 0.112670 0.123149 0.115423 0.130217 0.096134 0.086329 0.094292
qa: -0.2960 -0.4723 -0.4458 0.1518 -0.0520 -0.0704 -0.2930 -0.2731 -0.2743 0.3687 -0.0120 0.2783 -0.2257 -0.2541 -0.1434 -0.0599 -0.0038 0.2798 -0.2771 -0.2352 -0.0909 -0.2144 0.1025 0.0901 0.0982 0.0900 0.1011 0.0950 0.0944 0.0980 0.1235 0.1018 0.0878 0.0950 0.0941 0.1035 0.0938 0.0824 0.1003 0.0997 0.1055 0.1127 0.1231 0.1154 0.1302 0.0961 0.0863 0.0943
va: 2.1179 2.0304 2.0565 3.7224 3.8424 3.8032 3.9141 3.8812 3.8790 4.1781 3.7071 3.7154 3.9289 3.9457 3.9295 3.7859 3.4480 4.0827 3.9435 3.8737 3.8621 3.9513 1.0239 1.0343 1.0025 1.0016 0.9984 1.0177 1.0015 1.0018 1.0033 1.0345 1.0075 0.9965 0.9951 0.9970 0.9997 1.0122 1.0280 1.0244 1.0085 0.9995 0.9920 1.0245 0.9995 0.9961 1.0086 0.9968
dispcorr: -0.021749985 hartree
energy: -965.456869426884
dipole: 15.23083 -14.11019 1.12064 10.79941 -9.15952 1.63989 4.03056 -3.54103 0.48953
magnitude: 2.04565 au
magnitude: 5.19964 debye
