program: Orca
programVersion: 5.0.2
elementType: O O O C C C C C C C C C C C C C C C C C C C H H H H H H H H H H H H H H H H H H H H H H H H H H
charge: 0
multiplicity: 1
keywords: wb97x-d3
keywords: def2-TZVPP
keywords: def2/J RIJCOSX
keywords: DEFGRID2
keywords: scfconv7
keywords: smallprint printgap noloewdin
keywords: NOSOSCF
formula: C19H26O3
InChI: InChI=1/C19H26O3/c1-7-8-13-12(4)16(10-15(13)20)22-18(21)17-14(9-11(2)3)19(17,5)6/h7-9,14,16-17H,10H2,1-6H3
48 atoms
O  -0.153655 -0.360204 0.029041
O  0.889936 0.486091 -1.7666
O  -4.038728 -2.821218 0.209724
C  2.703691 1.786702 0.442372
C  3.404425 0.612843 -0.151972
C  1.981177 0.449439 0.363044
C  3.052847 2.238215 1.840269
C  2.309981 2.931199 -0.459853
C  4.526943 -0.081662 0.521462
C  0.884508 0.212229 -0.589873
C  5.095672 -1.21552 0.101138
C  -1.343676 -0.663847 -0.701821
C  6.259437 -1.814288 0.830954
C  4.64107 -1.981862 -1.102892
C  -1.812217 -2.079043 -0.398471
C  -2.469103 0.232482 -0.245557
C  -3.565669 -0.479405 0.084482
C  -3.259536 -1.917632 -0.003515
C  -2.292566 1.703897 -0.23912
C  -4.885158 -0.025555 0.506735
C  -5.524493 1.046025 0.033841
C  -6.871087 1.490749 0.487583
H  3.462618 0.635392 -1.236364
H  1.869415 -0.06198 1.312257
H  2.230895 2.816987 2.266142
H  3.249742 1.409061 2.519437
H  3.935959 2.880546 1.831295
H  2.158753 2.632992 -1.494715
H  1.394986 3.413818 -0.109808
H  3.099272 3.68566 -0.452892
H  4.926719 0.384685 1.416857
H  -1.170399 -0.520006 -1.770726
H  6.022446 -2.817994 1.193894
H  7.123867 -1.922457 0.170161
H  6.565628 -1.211294 1.686035
H  4.427811 -3.020574 -0.8371
H  3.746221 -1.572209 -1.568686
H  5.427426 -2.017046 -1.862123
H  -1.25646 -2.510019 0.437986
H  -1.710386 -2.7606 -1.243495
H  -3.070277 2.206832 0.332491
H  -2.317907 2.098409 -1.258503
H  -1.326104 1.985863 0.182221
H  -5.381114 -0.643701 1.250476
H  -5.064087 1.641559 -0.748909
H  -6.832529 2.510293 0.879023
H  -7.578583 1.508831 -0.344788
H  -7.276817 0.843839 1.2654
elementType: O C H
totalener: -965.43529856 hartree
nucrepener: 1769.40233962 hartree
electener: -2734.83763818 hartree
oneelecener: -4825.05235342 hartree
twoeener: 2090.21471524 hartree
cpcmener: -0.02805364 hartree
kineticenergy: 960.99167240 hartree
xcener: -95.141317507237 hartree
chargesum: -0.0000000
charge: -0.296261 -0.472878 -0.445094 0.146343 -0.061661 -0.054667 -0.295024 -0.272278 -0.256608 0.366187 -0.019189 0.277585 -0.231044 -0.252448 -0.145433 -0.067557 0.005440 0.278506 -0.271968 -0.237108 -0.093352 -0.215844 0.102073 0.090551 0.098816 0.088459 0.102887 0.095184 0.094275 0.097979 0.123145 0.102768 0.094653 0.093749 0.088054 0.095033 0.082551 0.098722 0.100191 0.100435 0.112283 0.121484 0.106695 0.117796 0.129564 0.094043 0.096563 0.086401
qa: -0.2963 -0.4729 -0.4451 0.1463 -0.0617 -0.0547 -0.2950 -0.2723 -0.2566 0.3662 -0.0192 0.2776 -0.2310 -0.2524 -0.1454 -0.0676 0.0054 0.2785 -0.2720 -0.2371 -0.0934 -0.2158 0.1021 0.0906 0.0988 0.0885 0.1029 0.0952 0.0943 0.0980 0.1231 0.1028 0.0947 0.0937 0.0881 0.0950 0.0826 0.0987 0.1002 0.1004 0.1123 0.1215 0.1067 0.1178 0.1296 0.0940 0.0966 0.0864
va: 2.1181 2.0307 2.0580 3.7430 3.8508 3.8035 3.9166 3.8813 3.8849 4.1833 3.7129 3.7142 3.9304 3.9446 3.9254 3.7888 3.4366 4.0868 3.9404 3.8686 3.8627 3.9518 1.0206 1.0344 1.0020 1.0019 0.9983 1.0180 1.0016 1.0015 1.0039 1.0347 0.9961 0.9955 1.0076 0.9979 1.0143 0.9976 1.0284 1.0240 1.0009 0.9935 1.0078 1.0226 1.0004 0.9969 0.9961 1.0086
dispcorr: -0.021572682 hartree
energy: -965.456871238175
dipole: 15.73840 -14.61851 1.11989 11.00704 -9.36609 1.64095 3.94152 -3.47470 0.46682
magnitude: 2.04078 au
magnitude: 5.18726 debye
