program: Orca
programVersion: 5.0.2
elementType: O O O C C C C C C C C C C C C C C C C C C C H H H H H H H H H H H H H H H H H H H H H H H H H H
charge: 0
multiplicity: 1
keywords: wb97x-d3
keywords: def2-TZVPP
keywords: def2/J RIJCOSX
keywords: DEFGRID2
keywords: scfconv7
keywords: smallprint printgap noloewdin
keywords: NOSOSCF
formula: C19H26O3
InChI: InChI=1/C19H26O3/c1-7-8-13-12(4)16(10-15(13)20)22-18(21)17-14(9-11(2)3)19(17,5)6/h7-9,14,16-17H,10H2,1-6H3
48 atoms
O  -0.266883 -0.448833 0.107356
O  0.875088 0.076852 -1.749306
O  -4.509499 -2.336388 0.27835
C  2.760177 1.426541 0.387659
C  3.37481 0.162594 -0.133755
C  1.952181 0.137621 0.38521
C  3.172567 1.941125 1.745071
C  2.445384 2.532814 -0.589157
C  4.42014 -0.575178 0.607456
C  0.832432 -0.069778 -0.551056
C  5.632604 -0.906669 0.151595
C  -1.468188 -0.730782 -0.615805
C  6.594483 -1.667086 1.014794
C  6.155923 -0.563598 -1.209702
C  -2.148721 -1.970577 -0.066377
C  -2.472728 0.375276 -0.429613
C  -3.688188 -0.098894 -0.075577
C  -3.596697 -1.565659 0.075889
C  -2.064565 1.778362 -0.679596
C  -4.894269 0.694456 0.105876
C  -6.090815 0.257281 0.512189
C  -7.280201 1.137689 0.674939
H  3.450814 0.125426 -1.215478
H  1.805195 -0.303575 1.365302
H  2.416611 2.620331 2.143997
H  3.317436 1.146868 2.476321
H  4.109188 2.497994 1.671401
H  2.265312 2.17852 -1.60176
H  1.570507 3.103673 -0.270721
H  3.28669 3.227438 -0.63486
H  4.165698 -0.872489 1.621103
H  -1.24249 -0.842633 -1.679102
H  6.176301 -1.898483 1.994642
H  6.886231 -2.609373 0.54273
H  7.51775 -1.101515 1.168342
H  5.439506 -0.03887 -1.838977
H  7.044513 0.068561 -1.127087
H  6.470792 -1.46481 -1.74243
H  -1.762203 -2.223116 0.924697
H  -2.039176 -2.851221 -0.698833
H  -2.900701 2.473733 -0.682766
H  -1.545636 1.86392 -1.636605
H  -1.362668 2.113933 0.088467
H  -4.794925 1.753995 -0.112061
H  -6.241523 -0.789042 0.745123
H  -7.064251 2.177622 0.430085
H  -8.102762 0.80148 0.038716
H  -7.654764 1.100017 1.700819
elementType: O C H
totalener: -965.43698963 hartree
nucrepener: 1753.25298400 hartree
electener: -2718.68997363 hartree
oneelecener: -4792.83088690 hartree
twoeener: 2074.14091327 hartree
cpcmener: -0.02697867 hartree
kineticenergy: 960.98587715 hartree
xcener: -95.142255340733 hartree
chargesum: 0.0000000
charge: -0.292426 -0.467176 -0.446227 0.120770 0.031504 -0.109646 -0.263344 -0.281122 -0.279064 0.383488 -0.043485 0.252396 -0.219949 -0.250502 -0.135724 -0.020521 -0.035229 0.277893 -0.248517 -0.242280 -0.080307 -0.216660 0.093364 0.088809 0.096767 0.087330 0.096916 0.094745 0.094519 0.097647 0.117449 0.104727 0.088093 0.093521 0.092532 0.088807 0.096272 0.094988 0.100888 0.096026 0.105469 0.111218 0.110197 0.118514 0.125995 0.082395 0.094826 0.094113
qa: -0.2924 -0.4672 -0.4462 0.1208 0.0315 -0.1096 -0.2633 -0.2811 -0.2791 0.3835 -0.0435 0.2524 -0.2199 -0.2505 -0.1357 -0.0205 -0.0352 0.2779 -0.2485 -0.2423 -0.0803 -0.2167 0.0934 0.0888 0.0968 0.0873 0.0969 0.0947 0.0945 0.0976 0.1174 0.1047 0.0881 0.0935 0.0925 0.0888 0.0963 0.0950 0.1009 0.0960 0.1055 0.1112 0.1102 0.1185 0.1260 0.0824 0.0948 0.0941
va: 2.1259 2.0377 2.0477 3.6796 3.7803 3.8712 3.9053 3.9024 3.8705 4.1860 3.7540 3.7732 3.9223 3.9427 3.9696 3.7168 3.5509 4.0467 3.9329 3.9123 3.8211 3.9589 1.0327 1.0383 1.0026 1.0055 1.0022 1.0177 1.0011 1.0015 1.0099 1.0317 1.0088 0.9961 0.9963 1.0100 0.9971 0.9974 1.0254 1.0260 1.0114 1.0068 0.9997 1.0190 1.0340 1.0086 0.9959 0.9958
dispcorr: -0.021164303 hartree
energy: -965.458153932518
dipole: 19.62903 -18.19564 1.43339 11.73545 -10.26572 1.46973 3.61633 -3.06910 0.54723
magnitude: 2.12466 au
magnitude: 5.40045 debye
