program: Orca
programVersion: 5.0.2
elementType: O O O C C C C C C C C C C C C C C C C C C C H H H H H H H H H H H H H H H H H H H H H H H H H H
charge: 0
multiplicity: 1
keywords: wb97x-d3
keywords: def2-TZVPP
keywords: def2/J RIJCOSX
keywords: DEFGRID2
keywords: scfconv7
keywords: smallprint printgap noloewdin
keywords: NOSOSCF
formula: C19H26O3
InChI: InChI=1/C19H26O3/c1-7-8-13-12(4)16(10-15(13)20)22-18(21)17-14(9-11(2)3)19(17,5)6/h7-9,14,16-17H,10H2,1-6H3
48 atoms
O  -0.19434 -0.377084 0.068661
O  0.869106 0.424421 -1.735275
O  -4.099519 -2.801348 0.268585
C  2.693893 1.738213 0.45174
C  3.37778 0.539414 -0.116942
C  1.950214 0.412185 0.399435
C  3.047155 2.220126 1.838745
C  2.322186 2.868497 -0.477536
C  4.484766 -0.160902 0.56971
C  0.854404 0.170337 -0.55422
C  5.18744 -1.18406 0.073049
C  -1.38053 -0.684766 -0.66734
C  6.320084 -1.788367 0.8468
C  4.929663 -1.820757 -1.258175
C  -1.863705 -2.090066 -0.341605
C  -2.50262 0.229716 -0.239762
C  -3.606031 -0.466623 0.100792
C  -3.311578 -1.908891 0.040893
C  -2.317253 1.69972 -0.269979
C  -4.924413 0.003758 0.506494
C  -5.549945 1.07866 0.022274
C  -6.898454 1.534179 0.458117
H  3.437466 0.54165 -1.200646
H  1.828177 -0.076712 1.359281
H  3.200692 1.408091 2.548704
H  3.956617 2.824253 1.818647
H  2.245464 2.846778 2.234357
H  2.178165 2.5523 -1.508027
H  1.409015 3.36733 -0.145735
H  3.119106 3.615124 -0.476477
H  4.752397 0.199729 1.558166
H  -1.195402 -0.563233 -1.737023
H  6.510734 -1.261027 1.781809
H  6.118957 -2.836293 1.085959
H  7.243879 -1.778762 0.261868
H  4.038036 -1.446581 -1.756998
H  5.778236 -1.672395 -1.930475
H  4.8135 -2.901312 -1.14544
H  -1.315486 -2.513571 0.503483
H  -1.764605 -2.786036 -1.175281
H  -3.083245 2.220365 0.301688
H  -2.357849 2.069701 -1.297864
H  -1.343032 1.986621 0.128727
H  -5.435964 -0.606708 1.245893
H  -5.077019 1.666875 -0.75844
H  -7.317747 0.893061 1.233357
H  -6.857825 2.554949 0.845614
H  -7.595655 1.553602 -0.382813
elementType: O C H
totalener: -965.43557448 hartree
nucrepener: 1764.94219687 hartree
electener: -2730.37777135 hartree
oneelecener: -4816.13845093 hartree
twoeener: 2085.76067958 hartree
cpcmener: -0.02822691 hartree
kineticenergy: 960.99505891 hartree
xcener: -95.142457604269 hartree
chargesum: 0.0000000
charge: -0.296919 -0.472827 -0.445270 0.130632 -0.046172 -0.048709 -0.294421 -0.273246 -0.252111 0.368945 -0.023789 0.278937 -0.230276 -0.258151 -0.145512 -0.066521 0.003307 0.279357 -0.273710 -0.236402 -0.092227 -0.215772 0.101058 0.091479 0.088579 0.103656 0.098294 0.095155 0.093609 0.098249 0.118789 0.102742 0.087794 0.094717 0.092751 0.086721 0.098321 0.094111 0.100367 0.100308 0.112093 0.122106 0.106354 0.116969 0.129577 0.086418 0.094069 0.096568
qa: -0.2969 -0.4728 -0.4453 0.1306 -0.0462 -0.0487 -0.2944 -0.2732 -0.2521 0.3689 -0.0238 0.2789 -0.2303 -0.2582 -0.1455 -0.0665 0.0033 0.2794 -0.2737 -0.2364 -0.0922 -0.2158 0.1011 0.0915 0.0886 0.1037 0.0983 0.0952 0.0936 0.0982 0.1188 0.1027 0.0878 0.0947 0.0928 0.0867 0.0983 0.0941 0.1004 0.1003 0.1121 0.1221 0.1064 0.1170 0.1296 0.0864 0.0941 0.0966
va: 2.1197 2.0322 2.0578 3.7516 3.8424 3.7953 3.9179 3.8875 3.8956 4.1909 3.7254 3.7132 3.9302 3.9445 3.9269 3.7871 3.4393 4.0855 3.9416 3.8691 3.8619 3.9520 1.0198 1.0339 1.0034 0.9987 1.0017 1.0182 1.0016 1.0011 1.0077 1.0349 1.0081 0.9959 0.9954 1.0132 0.9968 0.9976 1.0284 1.0241 1.0006 0.9930 1.0080 1.0233 1.0002 1.0086 0.9970 0.9960
dispcorr: -0.021350322 hartree
energy: -965.456924798892
dipole: 16.45654 -15.31455 1.14199 11.35856 -9.69078 1.66778 3.35122 -2.93731 0.41391
magnitude: 2.06324 au
magnitude: 5.24433 debye
