program: Orca
programVersion: 5.0.2
elementType: O O O C C C C C C C C C C C C C C C C C C C H H H H H H H H H H H H H H H H H H H H H H H H H H
charge: 0
multiplicity: 1
keywords: wb97x-d3
keywords: def2-TZVPP
keywords: def2/J RIJCOSX
keywords: DEFGRID2
keywords: scfconv7
keywords: smallprint printgap noloewdin
keywords: NOSOSCF
formula: C19H26O3
InChI: InChI=1/C19H26O3/c1-7-8-13-12(4)16(10-15(13)20)22-18(21)17-14(9-11(2)3)19(17,5)6/h7-9,14,16-17H,10H2,1-6H3
48 atoms
O  -0.078526 -0.164269 -0.119064
O  0.959811 0.654804 -1.929963
O  -3.758712 -2.885653 0.047554
C  2.851638 1.884552 0.266105
C  3.496946 0.692984 -0.355777
C  2.085768 0.57202 0.180427
C  3.263033 2.293355 1.659456
C  2.45699 3.05276 -0.604729
C  4.603031 -0.043989 0.310633
C  0.964422 0.380169 -0.753535
C  4.718223 -1.372941 0.376585
C  -1.270198 -0.482392 -0.840521
C  5.875317 -2.021534 1.073349
C  3.725044 -2.325292 -0.216332
C  -1.637279 -1.946837 -0.652439
C  -2.425614 0.295968 -0.262685
C  -3.449795 -0.513131 0.074577
C  -3.057187 -1.916166 -0.144595
C  -2.347685 1.77287 -0.165298
C  -4.76836 -0.188219 0.603316
C  -5.497825 0.879019 0.271884
C  -6.84437 1.184151 0.829583
H  3.551608 0.72914 -1.441757
H  1.975749 0.046866 1.12252
H  3.489943 1.438854 2.29744
H  4.15016 2.929778 1.628196
H  2.467647 2.863572 2.143612
H  2.312881 2.781523 -1.647891
H  1.536013 3.517141 -0.246644
H  3.238788 3.813511 -0.573039
H  5.384107 0.563749 0.760203
H  -1.145684 -0.228568 -1.895473
H  6.556132 -1.291782 1.511942
H  5.528295 -2.681856 1.87291
H  6.448832 -2.647673 0.384856
H  2.951574 -1.836529 -0.805323
H  4.228579 -3.04514 -0.866683
H  3.233781 -2.911398 0.565425
H  -0.995815 -2.426603 0.090577
H  -1.565309 -2.531321 -1.570305
H  -1.353059 2.100364 0.140912
H  -3.073431 2.175362 0.539482
H  -2.54198 2.229987 -1.139259
H  -5.184703 -0.90817 1.303056
H  -5.11851 1.578709 -0.466646
H  -7.177644 0.423682 1.535651
H  -6.843848 2.148541 1.34335
H  -7.588755 1.261344 0.033946
elementType: O C H
totalener: -965.43476278 hartree
nucrepener: 1782.39294951 hartree
electener: -2747.82771229 hartree
oneelecener: -4850.97848992 hartree
twoeener: 2103.15077764 hartree
cpcmener: -0.02792730 hartree
kineticenergy: 961.00652657 hartree
xcener: -95.143701649334 hartree
chargesum: 0.0000000
charge: -0.297056 -0.470801 -0.445580 0.137672 -0.009668 -0.104619 -0.282115 -0.280400 -0.298835 0.375875 -0.014143 0.285078 -0.227746 -0.241495 -0.147104 -0.071803 0.001563 0.285421 -0.278697 -0.235651 -0.089954 -0.215511 0.104600 0.096661 0.092646 0.098000 0.097029 0.094252 0.096402 0.096075 0.121243 0.102064 0.089170 0.093375 0.096325 0.083984 0.102460 0.100115 0.098717 0.101430 0.105789 0.112465 0.121573 0.116183 0.128348 0.086064 0.094518 0.096083
qa: -0.2971 -0.4708 -0.4456 0.1377 -0.0097 -0.1046 -0.2821 -0.2804 -0.2988 0.3759 -0.0141 0.2851 -0.2277 -0.2415 -0.1471 -0.0718 0.0016 0.2854 -0.2787 -0.2357 -0.0900 -0.2155 0.1046 0.0967 0.0926 0.0980 0.0970 0.0943 0.0964 0.0961 0.1212 0.1021 0.0892 0.0934 0.0963 0.0840 0.1025 0.1001 0.0987 0.1014 0.1058 0.1125 0.1216 0.1162 0.1283 0.0861 0.0945 0.0961
va: 2.1105 2.0386 2.0575 3.7015 3.8077 3.8074 3.9071 3.8958 3.8919 4.1606 3.7138 3.6987 3.9311 3.9341 3.9242 3.7872 3.4480 4.0812 3.9397 3.8705 3.8628 3.9519 1.0246 1.0302 1.0027 1.0002 1.0029 1.0177 1.0001 1.0020 1.0042 1.0367 1.0064 0.9968 0.9964 1.0120 0.9996 0.9987 1.0287 1.0232 1.0103 0.9994 0.9919 1.0241 1.0007 1.0088 0.9968 0.9962
dispcorr: -0.022184673 hartree
energy: -965.456947448060
dipole: 13.40886 -12.51175 0.89711 9.57535 -7.94887 1.62648 6.62893 -5.98176 0.64716
magnitude: 1.96699 au
magnitude: 4.99970 debye
