program: Orca
programVersion: 5.0.2
elementType: O O O C C C C C C C C C C C C C C C C C C C H H H H H H H H H H H H H H H H H H H H H H H H H H
charge: 0
multiplicity: 1
keywords: wb97x-d3
keywords: def2-TZVPP
keywords: def2/J RIJCOSX
keywords: DEFGRID2
keywords: scfconv7
keywords: smallprint printgap noloewdin
keywords: NOSOSCF
formula: C19H26O3
InChI: InChI=1/C19H26O3/c1-7-8-13-12(4)16(10-15(13)20)22-18(21)17-14(9-11(2)3)19(17,5)6/h7-9,14,16-17H,10H2,1-6H3
48 atoms
O  0.1393 0.303926 -0.87171
O  0.802428 2.368176 -1.430921
O  -4.049792 -1.594824 -1.305993
C  3.100824 -0.351483 -1.635935
C  2.787833 -0.547806 -0.19054
C  2.443444 0.773956 -0.847681
C  4.527958 -0.092812 -2.054244
C  2.316201 -1.122841 -2.668865
C  3.844095 -0.608265 0.853695
C  1.063322 1.239207 -1.085487
C  3.677561 -0.249657 2.129359
C  -1.242026 0.58392 -1.113892
C  4.785906 -0.379523 3.128321
C  2.39473 0.301961 2.669301
C  -1.910628 -0.59606 -1.794957
C  -1.97851 0.748149 0.189455
C  -3.077107 -0.037146 0.255808
C  -3.155512 -0.845943 -0.978413
C  -1.478742 1.721199 1.190924
C  -4.033053 -0.071124 1.351807
C  -5.107838 -0.858869 1.463093
C  -6.034538 -0.827404 2.627922
H  1.929257 -1.186834 -0.003257
H  3.106979 1.603234 -0.627915
H  5.070439 -1.032395 -2.18057
H  4.556784 0.432408 -3.010954
H  5.075311 0.513192 -1.332129
H  2.21973 -0.553871 -3.595896
H  2.838523 -2.051377 -2.909122
H  1.316319 -1.394883 -2.336405
H  4.809689 -1.005599 0.553222
H  -1.338198 1.496039 -1.707733
H  4.498364 -1.04012 3.950779
H  5.698237 -0.77577 2.682312
H  5.023221 0.587598 3.579632
H  2.552592 1.290967 3.107636
H  1.613864 0.391497 1.915635
H  2.009963 -0.331332 3.473211
H  -1.280507 -1.488222 -1.750284
H  -2.153119 -0.417559 -2.842637
H  -1.246697 2.676541 0.718106
H  -0.551531 1.363189 1.645218
H  -2.185726 1.905291 1.996229
H  -3.836414 0.623651 2.163184
H  -5.348974 -1.571792 0.684947
H  -5.731858 -0.097534 3.379078
H  -7.052148 -0.586907 2.3098
H  -6.090393 -1.807467 3.108196
elementType: O C H
totalener: -965.43285318 hartree
nucrepener: 1811.13269252 hartree
electener: -2776.56554570 hartree
oneelecener: -4908.21281891 hartree
twoeener: 2131.64727322 hartree
cpcmener: -0.02749983 hartree
kineticenergy: 960.99609504 hartree
xcener: -95.144148684071 hartree
chargesum: -0.0000000
charge: -0.281562 -0.465522 -0.445852 0.146771 0.006741 -0.137227 -0.296407 -0.266571 -0.303969 0.408207 -0.021234 0.222767 -0.231597 -0.207659 -0.138429 -0.015310 -0.042788 0.280288 -0.253045 -0.240726 -0.079605 -0.217149 0.104083 0.093743 0.098508 0.098291 0.092502 0.100999 0.096127 0.084247 0.122575 0.107830 0.094921 0.089236 0.094809 0.097777 0.052380 0.101264 0.104128 0.098722 0.112334 0.113200 0.107691 0.117222 0.126076 0.082317 0.094523 0.094373
qa: -0.2816 -0.4655 -0.4459 0.1468 0.0067 -0.1372 -0.2964 -0.2666 -0.3040 0.4082 -0.0212 0.2228 -0.2316 -0.2077 -0.1384 -0.0153 -0.0428 0.2803 -0.2530 -0.2407 -0.0796 -0.2171 0.1041 0.0937 0.0985 0.0983 0.0925 0.1010 0.0961 0.0842 0.1226 0.1078 0.0949 0.0892 0.0948 0.0978 0.0524 0.1013 0.1041 0.0987 0.1123 0.1132 0.1077 0.1172 0.1261 0.0823 0.0945 0.0944
va: 2.0997 2.0390 2.0505 3.7081 3.7797 3.8542 3.9133 3.8970 3.8772 4.1482 3.7313 3.7763 3.9301 3.9253 3.9658 3.6980 3.5504 4.0559 3.9388 3.9157 3.8199 3.9591 1.0246 1.0288 0.9992 1.0026 1.0017 1.0001 1.0022 1.0107 1.0026 1.0328 0.9959 1.0063 0.9967 0.9995 1.0211 1.0004 1.0233 1.0239 1.0084 0.9913 1.0103 1.0192 1.0344 1.0085 0.9960 0.9958
dispcorr: -0.023140306 hartree
energy: -965.455993487770
dipole: 14.41674 -13.07631 1.34044 -2.29806 2.33558 0.03753 12.33693 -11.13866 1.19827
magnitude: 1.79834 au
magnitude: 4.57102 debye
