program: Orca
programVersion: 5.0.2
elementType: O O O C C C C C C C C C C C C C C C C C C C H H H H H H H H H H H H H H H H H H H H H H H H H H
charge: 0
multiplicity: 1
keywords: wb97x-d3
keywords: def2-TZVPP
keywords: def2/J RIJCOSX
keywords: DEFGRID2
keywords: scfconv7
keywords: smallprint printgap noloewdin
keywords: NOSOSCF
formula: C19H26O3
InChI: InChI=1/C19H26O3/c1-7-8-13-12(4)16(10-15(13)20)22-18(21)17-14(9-11(2)3)19(17,5)6/h7-9,14,16-17H,10H2,1-6H3
48 atoms
O  -0.248303 -0.479488 0.115902
O  0.884083 0.102376 -1.729218
O  -4.497423 -2.355467 0.25604
C  2.728855 1.469958 0.425017
C  3.377974 0.226703 -0.10456
C  1.953199 0.162017 0.409939
C  3.113752 1.989938 1.788933
C  2.393028 2.573436 -0.548158
C  4.440856 -0.490229 0.627516
C  0.843046 -0.062785 -0.533365
C  5.598501 -0.931917 0.124124
C  -1.44412 -0.760099 -0.61624
C  6.585874 -1.650322 0.994805
C  6.034743 -0.768606 -1.299962
C  -2.131653 -1.99693 -0.067903
C  -2.447888 0.348912 -0.441023
C  -3.665671 -0.121683 -0.090656
C  -3.579702 -1.588339 0.062568
C  -2.041645 1.750539 -0.700923
C  -4.871004 0.674866 0.077444
C  -6.059418 0.255317 0.523673
C  -7.24387 1.146474 0.666485
H  3.453447 0.200731 -1.186199
H  1.812573 -0.290604 1.385492
H  2.337847 2.652878 2.177012
H  3.262157 1.198432 2.522512
H  4.039814 2.565944 1.730035
H  2.225052 2.219193 -1.562753
H  1.503788 3.122687 -0.230658
H  3.218867 3.286723 -0.58726
H  4.251265 -0.673593 1.681341
H  -1.209737 -0.876956 -1.677191
H  6.235129 -1.751725 2.021973
H  6.792981 -2.652697 0.609958
H  7.545202 -1.126042 1.017568
H  5.313408 -0.250267 -1.928829
H  6.974324 -0.211464 -1.350179
H  6.233141 -1.742688 -1.75569
H  -1.752677 -2.247473 0.926745
H  -2.018842 -2.88007 -0.696541
H  -2.870537 2.452152 -0.644488
H  -1.585108 1.840158 -1.689109
H  -1.288555 2.073562 0.022528
H  -4.77892 1.72403 -0.188147
H  -6.205652 -0.778897 0.808658
H  -7.028225 2.172115 0.365736
H  -8.079934 0.78336 0.063429
H  -7.598829 1.162333 1.700121
elementType: O C H
totalener: -965.43722600 hartree
nucrepener: 1754.83229842 hartree
electener: -2720.26952442 hartree
oneelecener: -4795.98376302 hartree
twoeener: 2075.71423860 hartree
cpcmener: -0.02715255 hartree
kineticenergy: 960.98678361 hartree
xcener: -95.142715724036 hartree
chargesum: 0.0000000
charge: -0.292424 -0.466429 -0.445538 0.109075 0.035431 -0.090548 -0.267979 -0.278860 -0.277321 0.376093 -0.049953 0.252823 -0.217476 -0.250781 -0.134903 -0.023977 -0.033948 0.276518 -0.245765 -0.242082 -0.078822 -0.216511 0.092663 0.088418 0.096512 0.087626 0.097561 0.094900 0.093567 0.098666 0.116821 0.104868 0.087776 0.092970 0.092603 0.089396 0.095742 0.095541 0.100902 0.096008 0.104387 0.112191 0.108665 0.118854 0.125364 0.082284 0.094906 0.094187
qa: -0.2924 -0.4664 -0.4455 0.1091 0.0354 -0.0905 -0.2680 -0.2789 -0.2773 0.3761 -0.0500 0.2528 -0.2175 -0.2508 -0.1349 -0.0240 -0.0339 0.2765 -0.2458 -0.2421 -0.0788 -0.2165 0.0927 0.0884 0.0965 0.0876 0.0976 0.0949 0.0936 0.0987 0.1168 0.1049 0.0878 0.0930 0.0926 0.0894 0.0957 0.0955 0.1009 0.0960 0.1044 0.1122 0.1087 0.1189 0.1254 0.0823 0.0949 0.0942
va: 2.1248 2.0373 2.0479 3.6830 3.7870 3.8429 3.9077 3.9015 3.8742 4.1947 3.7676 3.7740 3.9213 3.9413 3.9635 3.7253 3.5455 4.0506 3.9330 3.9096 3.8226 3.9586 1.0326 1.0368 1.0022 1.0064 1.0016 1.0180 1.0014 1.0013 1.0112 1.0313 1.0090 0.9963 0.9964 1.0107 0.9971 0.9969 1.0255 1.0259 1.0123 1.0055 1.0003 1.0188 1.0326 1.0086 0.9960 0.9958
dispcorr: -0.021148004 hartree
energy: -965.458374004790
dipole: 19.26037 -17.84389 1.41648 11.58717 -10.14976 1.43741 3.50456 -2.95821 0.54635
magnitude: 2.09071 au
magnitude: 5.31416 debye
