program: Orca
programVersion: 5.0.2
elementType: O O O C C C C C C C C C C C C C C C C C C C H H H H H H H H H H H H H H H H H H H H H H H H H H
charge: 0
multiplicity: 1
keywords: wb97x-d3
keywords: def2-TZVPP
keywords: def2/J RIJCOSX
keywords: DEFGRID2
keywords: scfconv7
keywords: smallprint printgap noloewdin
keywords: NOSOSCF
formula: C19H26O3
InChI: InChI=1/C19H26O3/c1-7-8-13-12(4)16(10-15(13)20)22-18(21)17-14(9-11(2)3)19(17,5)6/h7-9,14,16-17H,10H2,1-6H3
48 atoms
O  0.066774 0.695569 -0.905923
O  0.640407 2.859206 -0.952594
O  -4.143566 -1.095713 -1.673424
C  3.026681 0.194564 -1.595709
C  2.725582 -0.11603 -0.16155
C  2.347505 1.244303 -0.732334
C  4.440368 0.519756 -2.018374
C  2.262568 -0.541808 -2.670024
C  3.76621 -0.19467 0.880399
C  0.9494 1.692563 -0.878566
C  3.715444 -0.911271 2.008683
C  -1.333304 0.969327 -0.995887
C  4.86751 -0.900442 2.968668
C  2.565431 -1.775772 2.429733
C  -2.012633 0.004486 -1.950756
C  -1.984942 0.716402 0.337841
C  -3.062482 -0.092408 0.231858
C  -3.21776 -0.48673 -1.183842
C  -1.427849 1.361882 1.550908
C  -3.938531 -0.494105 1.32182
C  -4.930804 -1.38916 1.271525
C  -5.771593 -1.750803 2.446561
H  1.886112 -0.788357 -0.029236
H  2.993697 2.068508 -0.450337
H  4.436969 1.043088 -2.976604
H  4.967017 1.155462 -1.30764
H  5.02469 -0.39408 -2.144954
H  1.299259 -0.920354 -2.336341
H  2.093364 0.095943 -3.540296
H  2.846823 -1.401294 -3.005396
H  4.659822 0.397829 0.708274
H  -1.492356 2.007107 -1.298113
H  4.564792 -0.508612 3.943598
H  5.240838 -1.912807 3.146858
H  5.700039 -0.296112 2.607953
H  2.272184 -1.54675 3.457568
H  1.679017 -1.669676 1.806288
H  2.850878 -2.831673 2.422017
H  -1.369557 -0.853174 -2.166688
H  -2.297052 0.451668 -2.902952
H  -0.454373 0.931611 1.801563
H  -2.067721 1.253188 2.423687
H  -1.264497 2.42792 1.379397
H  -3.744074 -0.017286 2.278326
H  -5.163494 -1.900462 0.34585
H  -5.476778 -1.212547 3.347801
H  -6.825913 -1.537453 2.252895
H  -5.711403 -2.822006 2.654702
elementType: O C H
totalener: -965.43425135 hartree
nucrepener: 1801.95488208 hartree
electener: -2767.38913344 hartree
oneelecener: -4889.82209786 hartree
twoeener: 2122.43296443 hartree
cpcmener: -0.02829564 hartree
kineticenergy: 960.98345628 hartree
xcener: -95.142659344750 hartree
chargesum: -0.0000000
charge: -0.284520 -0.464809 -0.444519 0.099818 0.035251 -0.094531 -0.286832 -0.266514 -0.284290 0.398663 -0.032291 0.220722 -0.223556 -0.260408 -0.137871 -0.017494 -0.041403 0.281028 -0.240389 -0.242081 -0.079869 -0.216695 0.101835 0.090272 0.097431 0.090453 0.099372 0.084002 0.100307 0.096718 0.114151 0.110143 0.093442 0.092564 0.087650 0.093677 0.086668 0.101829 0.103703 0.097563 0.107717 0.104507 0.112910 0.118327 0.125037 0.082956 0.094727 0.094630
qa: -0.2845 -0.4648 -0.4445 0.0998 0.0353 -0.0945 -0.2868 -0.2665 -0.2843 0.3987 -0.0323 0.2207 -0.2236 -0.2604 -0.1379 -0.0175 -0.0414 0.2810 -0.2404 -0.2421 -0.0799 -0.2167 0.1018 0.0903 0.0974 0.0905 0.0994 0.0840 0.1003 0.0967 0.1142 0.1101 0.0934 0.0926 0.0877 0.0937 0.0867 0.1018 0.1037 0.0976 0.1077 0.1045 0.1129 0.1183 0.1250 0.0830 0.0947 0.0946
va: 2.1046 2.0410 2.0498 3.7167 3.7584 3.8149 3.9197 3.9048 3.8867 4.1993 3.7545 3.7628 3.9257 3.9410 3.9620 3.7198 3.5383 4.0513 3.9391 3.9099 3.8256 3.9587 1.0177 1.0307 1.0008 1.0075 1.0003 1.0130 0.9999 1.0007 1.0127 1.0335 0.9966 0.9952 1.0089 0.9970 1.0111 0.9967 1.0222 1.0253 0.9966 1.0103 1.0068 1.0186 1.0319 1.0084 0.9961 0.9957
dispcorr: -0.022128922 hartree
energy: -965.456380273689
dipole: 15.75590 -14.27508 1.48082 -8.77255 8.26933 -0.50322 11.98795 -10.80674 1.18120
magnitude: 1.95992 au
magnitude: 4.98172 debye
