program: Orca
programVersion: 5.0.2
elementType: O O O C C C C C C C C C C C C C C C C C C C H H H H H H H H H H H H H H H H H H H H H H H H H H
charge: 0
multiplicity: 1
keywords: wb97x-d3
keywords: def2-TZVPP
keywords: def2/J RIJCOSX
keywords: DEFGRID2
keywords: scfconv7
keywords: smallprint printgap noloewdin
keywords: NOSOSCF
formula: C19H26O3
InChI: InChI=1/C19H26O3/c1-7-8-13-12(4)16(10-15(13)20)22-18(21)17-14(9-11(2)3)19(17,5)6/h7-9,14,16-17H,10H2,1-6H3
48 atoms
O  -0.037747 -0.238445 0.016485
O  0.987354 0.562732 -1.809702
O  -4.091759 -2.51153 0.108275
C  2.868323 1.851523 0.371887
C  3.528118 0.678771 -0.265595
C  2.126102 0.522877 0.293089
C  3.289125 2.262433 1.762081
C  2.448285 3.018406 -0.487605
C  4.664201 -0.041008 0.366689
C  0.999156 0.305554 -0.628822
C  4.894898 -1.351622 0.254451
C  -1.225448 -0.575334 -0.703987
C  6.079066 -1.995268 0.907685
C  4.008232 -2.28166 -0.514457
C  -1.779852 -1.906887 -0.231647
C  -2.321466 0.418895 -0.425386
C  -3.481651 -0.188198 -0.088014
C  -3.255852 -1.647709 -0.045415
C  -2.049529 1.867968 -0.581111
C  -4.74956 0.479394 0.16384
C  -5.892855 -0.083838 0.568224
C  -7.148791 0.680718 0.802785
H  3.55601 0.717553 -1.352223
H  2.04103 -0.003292 1.237177
H  2.486339 2.810774 2.258792
H  3.545028 1.411497 2.393677
H  4.159667 2.920761 1.721947
H  2.229564 2.740007 -1.516162
H  1.565364 3.512361 -0.076396
H  3.251187 3.757882 -0.516302
H  5.365872 0.559411 0.939385
H  -1.015245 -0.593826 -1.77632
H  6.679239 -1.280407 1.470761
H  5.76549 -2.786736 1.593864
H  6.727721 -2.469743 0.166436
H  3.190029 -1.777109 -1.025442
H  4.583453 -2.826987 -1.26734
H  3.575245 -3.037994 0.1462
H  -1.353559 -2.187453 0.735413
H  -1.601436 -2.730104 -0.92318
H  -1.567461 2.069907 -1.539679
H  -1.361539 2.213815 0.194844
H  -2.947098 2.478733 -0.517168
H  -4.750511 1.553971 0.004868
H  -5.946141 -1.150548 0.74557
H  -7.95488 0.31125 0.163938
H  -7.495233 0.55542 1.831749
H  -7.02669 1.747319 0.612967
elementType: O C H
totalener: -965.43573322 hartree
nucrepener: 1777.01595350 hartree
electener: -2742.45168672 hartree
oneelecener: -4840.34461908 hartree
twoeener: 2097.89293236 hartree
cpcmener: -0.02595216 hartree
kineticenergy: 960.99011303 hartree
xcener: -95.142565941735 hartree
chargesum: -0.0000000
charge: -0.293447 -0.471697 -0.446443 0.153375 -0.028273 -0.102191 -0.286615 -0.278570 -0.291922 0.380023 -0.010652 0.251028 -0.227618 -0.241965 -0.132778 -0.022766 -0.036113 0.278013 -0.245042 -0.243077 -0.080490 -0.216904 0.104903 0.092704 0.097034 0.092922 0.098827 0.094047 0.095186 0.097036 0.121323 0.103790 0.088973 0.093405 0.096073 0.079704 0.100548 0.098761 0.100654 0.095727 0.110257 0.110199 0.105550 0.118499 0.126139 0.094759 0.094515 0.082591
qa: -0.2934 -0.4717 -0.4464 0.1534 -0.0283 -0.1022 -0.2866 -0.2786 -0.2919 0.3800 -0.0107 0.2510 -0.2276 -0.2420 -0.1328 -0.0228 -0.0361 0.2780 -0.2450 -0.2431 -0.0805 -0.2169 0.1049 0.0927 0.0970 0.0929 0.0988 0.0940 0.0952 0.0970 0.1213 0.1038 0.0890 0.0934 0.0961 0.0797 0.1005 0.0988 0.1007 0.0957 0.1103 0.1102 0.1056 0.1185 0.1261 0.0948 0.0945 0.0826
va: 2.1192 2.0293 2.0474 3.6995 3.8287 3.8156 3.9072 3.8886 3.8874 4.1597 3.7032 3.7799 3.9310 3.9379 3.9623 3.7234 3.5478 4.0472 3.9356 3.9106 3.8220 3.9587 1.0256 1.0320 1.0031 1.0019 0.9996 1.0176 1.0008 1.0021 1.0035 1.0316 1.0064 0.9966 0.9962 1.0151 0.9996 0.9984 1.0256 1.0260 1.0073 0.9997 1.0109 1.0190 1.0331 0.9960 0.9958 1.0085
dispcorr: -0.021974051 hartree
energy: -965.457707273921
dipole: 14.55539 -13.35990 1.19549 8.13592 -6.90098 1.23494 5.56906 -4.86338 0.70569
magnitude: 1.85802 au
magnitude: 4.72272 debye
