program: Orca
programVersion: 5.0.2
elementType: O O O C C C C C C C C C C C C C C C C C C C H H H H H H H H H H H H H H H H H H H H H H H H H H
charge: 0
multiplicity: 1
keywords: wb97x-d3
keywords: def2-TZVPP
keywords: def2/J RIJCOSX
keywords: DEFGRID2
keywords: scfconv7
keywords: smallprint printgap noloewdin
keywords: NOSOSCF
formula: C19H26O3
InChI: InChI=1/C19H26O3/c1-7-8-13-12(4)16(10-15(13)20)22-18(21)17-14(9-11(2)3)19(17,5)6/h7-9,14,16-17H,10H2,1-6H3
48 atoms
O  0.101111 -0.950961 0.089197
O  0.740996 -2.864469 1.037892
O  -4.254945 -0.497255 1.59674
C  2.65035 0.010983 1.682438
C  2.726514 0.199561 0.192863
C  2.351007 -1.153652 0.754704
C  3.917533 -0.098323 2.495002
C  1.529396 0.694539 2.42723
C  4.007037 0.363728 -0.522291
C  1.003363 -1.75078 0.648217
C  4.285204 1.29393 -1.442161
C  -1.236894 -1.434679 -0.052354
C  5.642994 1.366483 -2.074236
C  3.323507 2.345917 -1.909393
C  -2.049171 -1.408284 1.232151
C  -1.945451 -0.493423 -0.985997
C  -3.11561 -0.050464 -0.476598
C  -3.288892 -0.619239 0.876058
C  -1.337944 -0.197176 -2.305974
C  -4.059421 0.823103 -1.156295
C  -5.205175 1.312469 -0.670572
C  -6.110446 2.205242 -1.445455
H  1.898776 0.771185 -0.21018
H  3.124663 -1.914623 0.739538
H  4.312485 0.892991 2.727702
H  3.720029 -0.605171 3.441647
H  4.702089 -0.656252 1.985404
H  0.652719 0.879726 1.808979
H  1.215261 0.108138 3.293648
H  1.871078 1.663536 2.796921
H  4.794947 -0.336932 -0.260714
H  -1.211593 -2.436632 -0.492312
H  6.086869 2.356729 -1.939041
H  6.332922 0.630712 -1.660374
H  5.58336 1.202242 -3.153776
H  3.564791 3.314694 -1.464517
H  3.390682 2.47934 -2.990749
H  2.283789 2.131134 -1.671255
H  -1.51882 -0.891573 2.036519
H  -2.31335 -2.399514 1.600505
H  -0.431727 0.401302 -2.18824
H  -2.005006 0.345285 -2.971497
H  -1.03724 -1.121405 -2.803929
H  -3.787787 1.101107 -2.17059
H  -5.524722 1.069707 0.334908
H  -5.72887 2.414902 -2.444982
H  -7.103688 1.760696 -1.546766
H  -6.254995 3.157647 -0.929246
elementType: O C H
totalener: -965.43541865 hartree
nucrepener: 1796.14422858 hartree
electener: -2761.57964723 hartree
oneelecener: -4878.27878155 hartree
twoeener: 2116.69913432 hartree
cpcmener: -0.02925140 hartree
kineticenergy: 960.99740872 hartree
xcener: -95.143905970808 hartree
chargesum: -0.0000000
charge: -0.282104 -0.463244 -0.444929 0.103372 0.067422 -0.112939 -0.276454 -0.277644 -0.288198 0.399574 -0.048199 0.218326 -0.218206 -0.257144 -0.131308 -0.046675 -0.020003 0.283670 -0.252286 -0.240744 -0.078093 -0.217278 0.092035 0.092675 0.096531 0.098234 0.087568 0.085183 0.102327 0.098027 0.116756 0.111577 0.092900 0.087213 0.093410 0.103579 0.092327 0.087804 0.105550 0.103792 0.105021 0.100506 0.112459 0.118102 0.127053 0.082799 0.095026 0.094629
qa: -0.2821 -0.4632 -0.4449 0.1034 0.0674 -0.1129 -0.2765 -0.2776 -0.2882 0.3996 -0.0482 0.2183 -0.2182 -0.2571 -0.1313 -0.0467 -0.0200 0.2837 -0.2523 -0.2407 -0.0781 -0.2173 0.0920 0.0927 0.0965 0.0982 0.0876 0.0852 0.1023 0.0980 0.1168 0.1116 0.0929 0.0872 0.0934 0.1036 0.0923 0.0878 0.1055 0.1038 0.1050 0.1005 0.1125 0.1181 0.1271 0.0828 0.0950 0.0946
va: 2.1165 2.0421 2.0522 3.6981 3.7353 3.8645 3.9105 3.9034 3.8549 4.1767 3.7653 3.7772 3.9242 3.9428 3.9549 3.7489 3.5557 4.0541 3.9633 3.9075 3.8194 3.9587 1.0171 1.0313 1.0016 1.0014 1.0066 1.0155 0.9991 1.0024 1.0112 1.0159 0.9951 1.0092 0.9962 0.9954 0.9981 1.0087 1.0189 1.0259 0.9986 1.0103 0.9986 1.0175 1.0338 1.0085 0.9960 0.9958
dispcorr: -0.022137696 hartree
energy: -965.457556344576
dipole: 15.60059 -14.15111 1.44948 16.18303 -14.80564 1.37739 -7.79613 6.09275 -1.70338
magnitude: 2.62672 au
magnitude: 6.67660 debye
