program: Orca
programVersion: 5.0.2
elementType: O O O C C C C C C C C C C C C C C C C C C C H H H H H H H H H H H H H H H H H H H H H H H H H H
charge: 0
multiplicity: 1
keywords: wb97x-d3
keywords: def2-TZVPP
keywords: def2/J RIJCOSX
keywords: DEFGRID2
keywords: scfconv7
keywords: smallprint printgap noloewdin
keywords: NOSOSCF
formula: C19H26O3
InChI: InChI=1/C19H26O3/c1-7-8-13-12(4)16(10-15(13)20)22-18(21)17-14(9-11(2)3)19(17,5)6/h7-9,14,16-17H,10H2,1-6H3
48 atoms
O  0.030503 -0.029663 -1.030792
O  0.686907 -1.220245 -2.798838
O  -4.026644 -1.923829 -0.008079
C  2.73998 -1.379669 -0.015498
C  2.686313 0.121386 0.06779
C  2.321295 -0.559016 -1.22306
C  4.082026 -2.061095 -0.103285
C  1.712716 -2.176413 0.749155
C  3.919032 0.944906 0.134199
C  0.95019 -0.642138 -1.770496
C  4.424525 1.47745 1.249916
C  -1.330471 -0.09741 -1.469859
C  5.668423 2.312204 1.219477
C  3.815743 1.296055 2.606703
C  -1.994369 -1.440907 -1.214351
C  -2.107654 0.890709 -0.645175
C  -3.174495 0.327287 -0.037994
C  -3.195965 -1.114594 -0.357847
C  -1.66551 2.305616 -0.609383
C  -4.143941 1.028064 0.789472
C  -5.185267 0.500516 1.441561
C  -6.121951 1.30446 2.274233
H  1.848956 0.499754 0.645701
H  3.063381 -0.527066 -2.015168
H  3.981169 -3.056077 -0.541814
H  4.796616 -1.504783 -0.709301
H  4.516685 -2.181577 0.891625
H  0.777769 -1.637922 0.899254
H  1.48412 -3.116619 0.242114
H  2.100667 -2.425982 1.739058
H  4.44247 1.119934 -0.801756
H  -1.380317 0.186877 -2.525455
H  5.478531 3.315877 1.609816
H  6.447866 1.879217 1.852214
H  6.071724 2.415353 0.21198
H  2.945062 0.642143 2.608062
H  4.546961 0.871889 3.299942
H  3.514192 2.257377 3.031615
H  -1.342105 -2.130144 -0.672443
H  -2.306075 -1.944619 -2.129891
H  -1.432549 2.658249 -1.616209
H  -0.749529 2.409387 -0.022448
H  -2.407844 2.974624 -0.180462
H  -3.987507 2.098815 0.88328
H  -5.387385 -0.561647 1.387907
H  -6.128256 0.948525 3.307489
H  -5.863745 2.363663 2.281561
H  -7.148601 1.206628 1.912565
elementType: O C H
totalener: -965.43467630 hartree
nucrepener: 1794.86073922 hartree
electener: -2760.29541552 hartree
oneelecener: -4875.83671883 hartree
twoeener: 2115.54130331 hartree
cpcmener: -0.02867060 hartree
kineticenergy: 961.00201259 hartree
xcener: -95.142947311132 hartree
chargesum: -0.0000000
charge: -0.279601 -0.461996 -0.445830 0.151713 0.018034 -0.140637 -0.271496 -0.301863 -0.284726 0.396559 -0.027055 0.230230 -0.230426 -0.253358 -0.137934 -0.051235 -0.019003 0.283377 -0.260291 -0.239358 -0.077926 -0.217290 0.103035 0.097396 0.098889 0.090752 0.094836 0.086554 0.105932 0.098931 0.120119 0.110019 0.093935 0.093766 0.089016 0.086751 0.095512 0.099900 0.105497 0.107316 0.112061 0.110195 0.101929 0.117927 0.127919 0.094540 0.082634 0.094753
qa: -0.2796 -0.4620 -0.4458 0.1517 0.0180 -0.1406 -0.2715 -0.3019 -0.2847 0.3966 -0.0271 0.2302 -0.2304 -0.2534 -0.1379 -0.0512 -0.0190 0.2834 -0.2603 -0.2394 -0.0779 -0.2173 0.1030 0.0974 0.0989 0.0908 0.0948 0.0866 0.1059 0.0989 0.1201 0.1100 0.0939 0.0938 0.0890 0.0868 0.0955 0.0999 0.1055 0.1073 0.1121 0.1102 0.1019 0.1179 0.1279 0.0945 0.0826 0.0948
va: 2.1210 2.0432 2.0518 3.6730 3.7534 3.9275 3.9009 3.9031 3.8586 4.1847 3.7039 3.7643 3.9288 3.9419 3.9511 3.7533 3.5600 4.0464 3.9608 3.9071 3.8186 3.9589 1.0096 1.0311 1.0028 1.0027 1.0024 1.0145 0.9990 1.0033 1.0079 1.0160 0.9954 0.9964 1.0079 1.0085 0.9980 0.9977 1.0207 1.0238 0.9989 0.9982 1.0090 1.0172 1.0339 0.9959 1.0085 0.9961
dispcorr: -0.022462906 hartree
energy: -965.457139203881
dipole: 16.24893 -14.95370 1.29523 8.61464 -6.67352 1.94112 15.26564 -14.27170 0.99395
magnitude: 2.53643 au
magnitude: 6.44709 debye
