program: Orca
programVersion: 5.0.2
elementType: O O O C C C C C C C C C C C C C C C C C C C H H H H H H H H H H H H H H H H H H H H H H H H H H
charge: 0
multiplicity: 1
keywords: wb97x-d3
keywords: def2-TZVPP
keywords: def2/J RIJCOSX
keywords: DEFGRID2
keywords: scfconv7
keywords: smallprint printgap noloewdin
keywords: NOSOSCF
formula: C19H26O3
InChI: InChI=1/C19H26O3/c1-7-8-13-12(4)16(10-15(13)20)22-18(21)17-14(9-11(2)3)19(17,5)6/h7-9,14,16-17H,10H2,1-6H3
48 atoms
O  -0.196244 0.607108 -0.372079
O  1.088264 0.386256 -2.184159
O  -3.422763 -2.607684 -1.174214
C  3.252283 1.791001 -0.379485
C  3.462801 0.317647 -0.355428
C  2.080673 0.873451 -0.057611
C  3.745311 2.617283 0.78445
C  3.319537 2.523002 -1.696947
C  4.230733 -0.36312 0.719516
C  0.982513 0.606249 -0.999887
C  3.9058 -1.540617 1.259469
C  -1.360706 0.303607 -1.146079
C  4.738334 -2.163034 2.338117
C  2.691262 -2.321835 0.858054
C  -1.497543 -1.170107 -1.504686
C  -2.55183 0.617357 -0.280962
C  -3.390695 -0.432741 -0.181089
C  -2.858696 -1.553761 -0.975746
C  -2.70049 1.975248 0.295288
C  -4.662218 -0.560892 0.516387
C  -4.987081 0.039088 1.664103
C  -6.2957 -0.123398 2.355303
H  3.541128 -0.138132 -1.340331
H  1.782483 0.867737 0.984686
H  3.178977 3.547338 0.86198
H  3.653371 2.09643 1.737848
H  4.796238 2.88305 0.651014
H  3.061192 1.898382 -2.54882
H  2.65646 3.39067 -1.700817
H  4.335782 2.888507 -1.85892
H  5.131333 0.136325 1.066757
H  -1.378833 0.938336 -2.03754
H  5.137924 -3.129087 2.018256
H  5.577805 -1.531483 2.62941
H  4.138539 -2.359051 3.231134
H  2.936672 -3.378716 0.729217
H  1.925914 -2.276787 1.63865
H  2.24019 -1.97175 -0.069123
H  -0.740525 -1.783523 -1.008468
H  -1.423838 -1.364857 -2.574663
H  -2.181095 2.055835 1.253485
H  -3.746395 2.226252 0.471848
H  -2.267806 2.728511 -0.364714
H  -5.380286 -1.238815 0.062298
H  -4.262555 0.67675 2.161189
H  -6.961361 -0.800389 1.819901
H  -6.156592 -0.509883 3.367758
H  -6.803062 0.838674 2.462098
elementType: O C H
totalener: -965.43587162 hartree
nucrepener: 1790.61008503 hartree
electener: -2756.04595665 hartree
oneelecener: -4867.54723904 hartree
twoeener: 2111.50128239 hartree
cpcmener: -0.02805688 hartree
kineticenergy: 960.99687894 hartree
xcener: -95.140640850935 hartree
chargesum: 0.0000000
charge: -0.292161 -0.472699 -0.444554 0.146122 -0.015065 -0.080053 -0.284143 -0.280770 -0.302327 0.363093 -0.006725 0.250778 -0.228068 -0.242330 -0.138448 -0.055250 0.011383 0.278493 -0.305757 -0.232344 -0.087962 -0.214468 0.103912 0.092017 0.097269 0.092293 0.098780 0.093295 0.098335 0.094728 0.121541 0.103734 0.096285 0.088809 0.094043 0.101535 0.103191 0.080836 0.104014 0.102297 0.120148 0.113404 0.111917 0.113191 0.130133 0.086940 0.095946 0.094663
qa: -0.2922 -0.4727 -0.4446 0.1461 -0.0151 -0.0801 -0.2841 -0.2808 -0.3023 0.3631 -0.0067 0.2508 -0.2281 -0.2423 -0.1384 -0.0553 0.0114 0.2785 -0.3058 -0.2323 -0.0880 -0.2145 0.1039 0.0920 0.0973 0.0923 0.0988 0.0933 0.0983 0.0947 0.1215 0.1037 0.0963 0.0888 0.0940 0.1015 0.1032 0.0808 0.1040 0.1023 0.1201 0.1134 0.1119 0.1132 0.1301 0.0869 0.0959 0.0947
va: 2.1152 2.0344 2.0593 3.7015 3.8167 3.8147 3.9087 3.8915 3.8957 4.1542 3.7019 3.7720 3.9335 3.9375 3.9022 3.7485 3.4685 4.0788 3.9616 3.8757 3.8554 3.9523 1.0254 1.0300 1.0033 1.0023 0.9999 1.0191 0.9992 1.0010 1.0040 1.0153 0.9964 1.0064 0.9960 1.0009 0.9974 1.0108 1.0230 1.0265 0.9923 0.9995 1.0039 1.0278 0.9999 1.0084 0.9961 0.9971
dispcorr: -0.022179427 hartree
energy: -965.458051049337
dipole: 12.15094 -11.57254 0.57840 6.40270 -4.42869 1.97402 13.33868 -11.61848 1.72020
magnitude: 2.68149 au
magnitude: 6.81580 debye
