program: Orca
programVersion: 5.0.2
elementType: O O O C C C C C C C C C C C C C C C C C C C H H H H H H H H H H H H H H H H H H H H H H H H H H
charge: 0
multiplicity: 1
keywords: wb97x-d3
keywords: def2-TZVPP
keywords: def2/J RIJCOSX
keywords: DEFGRID2
keywords: scfconv7
keywords: smallprint printgap noloewdin
keywords: NOSOSCF
formula: C19H26O3
InChI: InChI=1/C19H26O3/c1-7-8-13-12(4)16(10-15(13)20)22-18(21)17-14(9-11(2)3)19(17,5)6/h7-9,14,16-17H,10H2,1-6H3
48 atoms
O  0.128426 -0.718709 0.093638
O  0.95497 -2.78927 0.079322
O  -4.20541 -1.317253 1.578106
C  2.708618 -0.269979 1.86416
C  2.699297 0.487413 0.577462
C  2.424762 -1.003864 0.562768
C  4.024744 -0.609107 2.520783
C  1.596316 -0.026216 2.854781
C  3.928931 1.032053 -0.05238
C  1.116225 -1.600398 0.229892
C  4.015178 1.402805 -1.332688
C  -1.159382 -1.21111 -0.285705
C  5.263493 2.011073 -1.893121
C  2.87626 1.268001 -2.297791
C  -1.944366 -1.831517 0.863215
C  -1.979443 -0.030846 -0.740397
C  -3.177251 0.008013 -0.124168
C  -3.250592 -1.073354 0.872888
C  -1.461821 0.878803 -1.790861
C  -4.294729 0.924352 -0.314384
C  -4.687117 1.430041 -1.485526
C  -5.828174 2.370481 -1.659376
H  1.814251 1.100253 0.432824
H  3.239816 -1.636759 0.228642
H  4.373373 0.218875 3.141886
H  3.914179 -1.481302 3.168103
H  4.809179 -0.836919 1.798916
H  0.677157 0.32472 2.388946
H  1.365037 -0.931683 3.419822
H  1.903748 0.736939 3.572867
H  4.79725 1.168046 0.585872
H  -1.042232 -1.912843 -1.117414
H  6.04749 2.111168 -1.142293
H  5.658238 1.410393 -2.716839
H  5.064265 3.004226 -2.305524
H  2.098627 0.590109 -1.946685
H  2.408401 2.238953 -2.48739
H  3.227143 0.90102 -3.265047
H  -1.436217 -1.696536 1.821667
H  -2.120626 -2.900207 0.737998
H  -1.978253 1.837551 -1.789484
H  -1.597548 0.432277 -2.779963
H  -0.393227 1.060974 -1.673995
H  -4.856775 1.178539 0.580509
H  -4.168239 1.13926 -2.3941
H  -6.57223 1.961508 -2.346868
H  -6.323194 2.59558 -0.714787
H  -5.490363 3.312114 -2.099276
elementType: O C H
totalener: -965.43314181 hartree
nucrepener: 1810.34526849 hartree
electener: -2775.77841030 hartree
oneelecener: -4906.54784924 hartree
twoeener: 2130.76943894 hartree
cpcmener: -0.02994697 hartree
kineticenergy: 960.99219732 hartree
xcener: -95.140712618791 hartree
chargesum: -0.0000000
charge: -0.284917 -0.464758 -0.443450 0.151571 -0.013743 -0.097542 -0.300640 -0.271341 -0.297565 0.389892 -0.006497 0.254634 -0.226986 -0.253110 -0.143277 -0.089380 0.017677 0.277282 -0.274180 -0.232691 -0.091772 -0.214621 0.106493 0.092997 0.099972 0.099324 0.090162 0.085984 0.102499 0.096484 0.124084 0.108046 0.087761 0.094803 0.094497 0.069573 0.106816 0.096083 0.105435 0.104780 0.112882 0.120896 0.091683 0.117839 0.129291 0.095884 0.086661 0.094486
qa: -0.2849 -0.4648 -0.4434 0.1516 -0.0137 -0.0975 -0.3006 -0.2713 -0.2976 0.3899 -0.0065 0.2546 -0.2270 -0.2531 -0.1433 -0.0894 0.0177 0.2773 -0.2742 -0.2327 -0.0918 -0.2146 0.1065 0.0930 0.1000 0.0993 0.0902 0.0860 0.1025 0.0965 0.1241 0.1080 0.0878 0.0948 0.0945 0.0696 0.1068 0.0961 0.1054 0.1048 0.1129 0.1209 0.0917 0.1178 0.1293 0.0959 0.0867 0.0945
va: 2.1049 2.0408 2.0610 3.7292 3.7927 3.8390 3.9139 3.8806 3.8652 4.1556 3.6973 3.7172 3.9315 3.9476 3.9081 3.8042 3.4402 4.0955 3.9603 3.8666 3.8618 3.9521 1.0132 1.0292 0.9990 1.0020 1.0016 1.0159 0.9991 1.0028 1.0035 1.0186 1.0074 0.9966 0.9946 1.0128 0.9957 1.0020 1.0208 1.0248 1.0022 0.9913 1.0141 1.0228 1.0005 0.9964 1.0085 0.9968
dispcorr: -0.023316588 hartree
energy: -965.456458400222
dipole: 14.41363 -13.04541 1.36821 15.77690 -13.77849 1.99842 -6.56824 5.04864 -1.51960
magnitude: 2.85917 au
magnitude: 7.26743 debye
