program: Orca
programVersion: 5.0.2
elementType: O O O C C C C C C C C C C C C C C C C C C C H H H H H H H H H H H H H H H H H H H H H H H H H H
charge: 0
multiplicity: 1
keywords: wb97x-d3
keywords: def2-TZVPP
keywords: def2/J RIJCOSX
keywords: DEFGRID2
keywords: scfconv7
keywords: smallprint printgap noloewdin
keywords: NOSOSCF
formula: C19H26O3
InChI: InChI=1/C19H26O3/c1-7-8-13-12(4)16(10-15(13)20)22-18(21)17-14(9-11(2)3)19(17,5)6/h7-9,14,16-17H,10H2,1-6H3
48 atoms
O  0.114701 -0.795169 0.145756
O  1.009267 -2.799481 0.545157
O  -4.28059 -1.230554 1.572898
C  2.613427 0.014608 1.922531
C  2.587237 0.599607 0.548208
C  2.398054 -0.893199 0.722217
C  3.932335 -0.159582 2.634575
C  1.466149 0.314819 2.856668
C  3.795894 1.135329 -0.128883
C  1.124666 -1.598144 0.472455
C  3.899089 1.324851 -1.447102
C  -1.156329 -1.388597 -0.133006
C  5.124166 1.931515 -2.058502
C  2.811593 0.966522 -2.413277
C  -1.958202 -1.755965 1.10726
C  -1.977023 -0.352307 -0.85078
C  -3.17861 -0.173845 -0.267837
C  -3.287245 -1.068332 0.898613
C  -1.445614 0.277617 -2.082819
C  -4.292748 0.677755 -0.660694
C  -4.188932 1.877366 -1.237708
C  -5.348392 2.723259 -1.633565
H  1.671877 1.135776 0.315372
H  3.25092 -1.520038 0.484219
H  3.860415 -0.950623 3.383721
H  4.744122 -0.425594 1.957409
H  4.217697 0.758338 3.153114
H  1.713268 1.176087 3.480768
H  0.540984 0.554539 2.334533
H  1.26941 -0.526459 3.524794
H  4.631115 1.426732 0.501556
H  -1.013632 -2.252767 -0.78888
H  4.875131 2.834165 -2.623236
H  5.869304 2.200348 -1.309563
H  5.591513 1.243937 -2.768542
H  3.216248 0.420964 -3.269136
H  2.027897 0.353494 -1.970193
H  2.339263 1.866346 -2.818026
H  -1.495505 -1.368087 2.018755
H  -2.087168 -2.830426 1.238521
H  -2.246644 0.600575 -2.74803
H  -0.798972 -0.412434 -2.626863
H  -0.846075 1.160793 -1.848546
H  -5.283096 0.294228 -0.429394
H  -3.206545 2.300662 -1.423718
H  -5.331865 2.927688 -2.706935
H  -6.301602 2.252613 -1.392952
H  -5.311279 3.695493 -1.136531
elementType: O C H
totalener: -965.43354820 hartree
nucrepener: 1816.10736812 hartree
electener: -2781.54091632 hartree
oneelecener: -4918.02395130 hartree
twoeener: 2136.48303498 hartree
cpcmener: -0.02971861 hartree
kineticenergy: 961.00136744 hartree
xcener: -95.141732139677 hartree
chargesum: 0.0000000
charge: -0.280167 -0.464229 -0.442921 0.152485 -0.014113 -0.105552 -0.302867 -0.272476 -0.291219 0.397768 -0.016939 0.214297 -0.227376 -0.239589 -0.130141 -0.046543 0.020585 0.279902 -0.329679 -0.237606 -0.087216 -0.214636 0.105379 0.093593 0.099575 0.090590 0.099806 0.097705 0.085012 0.103580 0.123867 0.107989 0.093719 0.088015 0.095246 0.095718 0.065930 0.103638 0.106132 0.102996 0.121706 0.114966 0.121058 0.113807 0.130615 0.094502 0.086949 0.096137
qa: -0.2802 -0.4642 -0.4429 0.1525 -0.0141 -0.1056 -0.3029 -0.2725 -0.2912 0.3978 -0.0169 0.2143 -0.2274 -0.2396 -0.1301 -0.0465 0.0206 0.2799 -0.3297 -0.2376 -0.0872 -0.2146 0.1054 0.0936 0.0996 0.0906 0.0998 0.0977 0.0850 0.1036 0.1239 0.1080 0.0937 0.0880 0.0952 0.0957 0.0659 0.1036 0.1061 0.1030 0.1217 0.1150 0.1211 0.1138 0.1306 0.0945 0.0869 0.0961
va: 2.1016 2.0407 2.0601 3.7223 3.7912 3.8405 3.9126 3.8809 3.8626 4.1518 3.7119 3.7706 3.9306 3.9426 3.9070 3.7151 3.4611 4.0868 3.9592 3.8826 3.8534 3.9511 1.0170 1.0288 1.0021 1.0015 0.9988 1.0031 1.0147 0.9988 1.0034 1.0173 0.9953 1.0073 0.9965 1.0015 1.0169 0.9973 1.0189 1.0272 1.0017 1.0011 0.9897 1.0273 0.9992 0.9972 1.0084 0.9962
dispcorr: -0.023455756 hartree
energy: -965.457003957963
dipole: 14.81983 -13.37808 1.44175 16.33721 -14.41239 1.92481 -7.59096 5.98300 -1.60796
magnitude: 2.89294 au
magnitude: 7.35327 debye
