program: Orca
programVersion: 5.0.2
elementType: O O O C C C C C C C C C C C C C C C C C C C H H H H H H H H H H H H H H H H H H H H H H H H H H
charge: 0
multiplicity: 1
keywords: wb97x-d3
keywords: def2-TZVPP
keywords: def2/J RIJCOSX
keywords: DEFGRID2
keywords: scfconv7
keywords: smallprint printgap noloewdin
keywords: NOSOSCF
formula: C19H26O3
InChI: InChI=1/C19H26O3/c1-7-8-13-12(4)16(10-15(13)20)22-18(21)17-14(9-11(2)3)19(17,5)6/h7-9,14,16-17H,10H2,1-6H3
48 atoms
O  -0.067064 -0.268507 0.036771
O  0.967119 0.552674 -1.775029
O  -4.137396 -2.505955 0.114306
C  2.847023 1.827557 0.398636
C  3.501769 0.634825 -0.205223
C  2.087381 0.508724 0.338124
C  3.249676 2.263709 1.786615
C  2.458954 2.982469 -0.492342
C  4.621139 -0.089171 0.449454
C  0.971608 0.2873 -0.595914
C  4.940045 -1.365235 0.216301
C  -1.249888 -0.597849 -0.695404
C  6.115401 -2.011251 0.883075
C  4.172261 -2.246782 -0.719601
C  -1.819091 -1.923173 -0.22258
C  -2.341264 0.406333 -0.432437
C  -3.507199 -0.189777 -0.095815
C  -3.293336 -1.650609 -0.042031
C  -2.06344 1.85159 -0.609658
C  -4.77281 0.488343 0.1384
C  -5.912328 -0.056465 0.576701
C  -7.165099 0.71958 0.789881
H  3.53949 0.64942 -1.291627
H  1.983087 0.002503 1.290982
H  2.452963 2.850332 2.248121
H  3.462761 1.424108 2.448379
H  4.14104 2.893685 1.749546
H  2.276518 2.689182 -1.523703
H  1.56399 3.485587 -0.120268
H  3.265183 3.718914 -0.503504
H  5.23717 0.477808 1.141638
H  -1.028035 -0.623201 -1.765262
H  5.803356 -2.871569 1.481239
H  6.826118 -2.392173 0.144597
H  6.6487 -1.321855 1.537768
H  4.786111 -2.525054 -1.58089
H  3.893726 -3.182284 -0.227688
H  3.261341 -1.785248 -1.098111
H  -1.397575 -2.208339 0.745161
H  -1.64713 -2.748213 -0.913641
H  -1.668409 2.045893 -1.609391
H  -1.302446 2.188465 0.098773
H  -2.942881 2.474821 -0.465291
H  -4.775777 1.554918 -0.066819
H  -5.963961 -1.113951 0.80323
H  -7.980296 0.318731 0.182305
H  -7.49679 0.648024 1.828827
H  -7.045354 1.774893 0.543746
elementType: O C H
totalener: -965.43587598 hartree
nucrepener: 1773.80095338 hartree
electener: -2739.23682936 hartree
oneelecener: -4833.93937378 hartree
twoeener: 2094.70254442 hartree
cpcmener: -0.02617747 hartree
kineticenergy: 960.98829123 hartree
xcener: -95.142135546496 hartree
chargesum: -0.0000000
charge: -0.293687 -0.471932 -0.446038 0.156137 -0.044617 -0.084842 -0.291010 -0.275948 -0.281213 0.373971 -0.012243 0.253265 -0.226030 -0.246492 -0.133021 -0.027571 -0.035005 0.278099 -0.242041 -0.242679 -0.079724 -0.216613 0.104582 0.090297 0.097512 0.091657 0.099541 0.094479 0.095382 0.096917 0.122748 0.104033 0.094766 0.094144 0.088630 0.102420 0.094563 0.080508 0.100692 0.095931 0.112290 0.108236 0.103167 0.119182 0.125687 0.094777 0.094489 0.082600
qa: -0.2937 -0.4719 -0.4460 0.1561 -0.0446 -0.0848 -0.2910 -0.2759 -0.2812 0.3740 -0.0122 0.2533 -0.2260 -0.2465 -0.1330 -0.0276 -0.0350 0.2781 -0.2420 -0.2427 -0.0797 -0.2166 0.1046 0.0903 0.0975 0.0917 0.0995 0.0945 0.0954 0.0969 0.1227 0.1040 0.0948 0.0941 0.0886 0.1024 0.0946 0.0805 0.1007 0.0959 0.1123 0.1082 0.1032 0.1192 0.1257 0.0948 0.0945 0.0826
va: 2.1189 2.0287 2.0476 3.7037 3.8423 3.8122 3.9115 3.8828 3.8783 4.1660 3.7062 3.7773 3.9287 3.9431 3.9602 3.7352 3.5454 4.0485 3.9373 3.9077 3.8233 3.9588 1.0242 1.0335 1.0028 1.0016 0.9989 1.0179 1.0010 1.0019 1.0031 1.0313 0.9969 0.9958 1.0069 0.9981 0.9994 1.0137 1.0258 1.0259 1.0046 1.0010 1.0117 1.0184 1.0321 0.9961 0.9957 1.0086
dispcorr: -0.021790819 hartree
energy: -965.457666799963
dipole: 14.99606 -13.76879 1.22727 8.27180 -7.03655 1.23524 5.00298 -4.35170 0.65128
magnitude: 1.85908 au
magnitude: 4.72541 debye
