program: Orca
programVersion: 5.0.2
elementType: O O O C C C C C C C C C C C C C C C C C C C H H H H H H H H H H H H H H H H H H H H H H H H H H
charge: 0
multiplicity: 1
keywords: wb97x-d3
keywords: def2-TZVPP
keywords: def2/J RIJCOSX
keywords: DEFGRID2
keywords: scfconv7
keywords: smallprint printgap noloewdin
keywords: NOSOSCF
formula: C19H26O3
InChI: InChI=1/C19H26O3/c1-7-8-13-12(4)16(10-15(13)20)22-18(21)17-14(9-11(2)3)19(17,5)6/h7-9,14,16-17H,10H2,1-6H3
48 atoms
O  -0.191461 -1.464574 0.922417
O  -0.110702 0.617447 0.11084
O  -4.442378 0.514258 1.642115
C  2.769077 0.559948 1.359959
C  2.862892 0.305577 -0.112249
C  1.908357 -0.519853 0.719535
C  3.879887 0.060624 2.250993
C  2.159965 1.854535 1.837682
C  4.037664 -0.360465 -0.728431
C  0.45442 -0.35821 0.543041
C  5.03968 0.271098 -1.345563
C  -1.617774 -1.503492 0.870178
C  6.178179 -0.487499 -1.956923
C  5.12478 1.760714 -1.47737
C  -2.335737 -0.63602 1.892717
C  -2.217925 -1.119117 -0.454142
C  -3.318802 -0.34987 -0.303511
C  -3.509649 -0.067302 1.12887
C  -1.649107 -1.629609 -1.727987
C  -4.167759 0.115966 -1.388678
C  -5.187832 0.97633 -1.301635
C  -6.000325 1.414045 -2.470474
H  2.378819 1.06211 -0.723854
H  2.220345 -1.535759 0.937739
H  4.275249 -0.903319 1.931726
H  4.710064 0.770635 2.256826
H  3.530988 -0.048229 3.279795
H  1.455364 2.285799 1.130128
H  1.64245 1.72211 2.790367
H  2.951031 2.590705 1.995851
H  4.072512 -1.444685 -0.667212
H  -1.83656 -2.559483 1.050502
H  6.065898 -1.565611 -1.840212
H  6.265322 -0.272499 -3.025422
H  7.130782 -0.197216 -1.505434
H  5.155139 2.059023 -2.528762
H  4.296132 2.285425 -1.00416
H  6.049707 2.131112 -1.027264
H  -1.714571 0.189387 2.24829
H  -2.670139 -1.1903 2.769831
H  -0.937317 -2.437196 -1.562102
H  -1.125091 -0.832496 -2.260486
H  -2.427121 -1.999672 -2.396874
H  -3.921345 -0.275905 -2.372073
H  -5.463675 1.40195 -0.344946
H  -7.053909 1.159346 -2.330842
H  -5.963025 2.500061 -2.587665
H  -5.662768 0.960099 -3.40242
elementType: O C H
totalener: -965.43282327 hartree
nucrepener: 1792.60681517 hartree
electener: -2758.03963843 hartree
oneelecener: -4872.15482401 hartree
twoeener: 2114.11518558 hartree
cpcmener: -0.02845762 hartree
kineticenergy: 961.00115566 hartree
xcener: -95.145618252945 hartree
chargesum: -0.0000000
charge: -0.303375 -0.465175 -0.454756 0.142573 -0.017432 -0.127784 -0.269080 -0.298992 -0.256960 0.405977 -0.035465 0.300354 -0.228997 -0.249574 -0.153246 -0.000027 -0.071431 0.272090 -0.288850 -0.238009 -0.085061 -0.217655 0.101940 0.088573 0.091111 0.095840 0.099277 0.095480 0.100692 0.095908 0.119888 0.117746 0.088659 0.094314 0.094070 0.099139 0.087554 0.095439 0.111443 0.102796 0.108344 0.123363 0.118242 0.115314 0.123915 0.094210 0.094496 0.083123
qa: -0.3034 -0.4652 -0.4548 0.1426 -0.0174 -0.1278 -0.2691 -0.2990 -0.2570 0.4060 -0.0355 0.3004 -0.2290 -0.2496 -0.1532 -0.0000 -0.0714 0.2721 -0.2889 -0.2380 -0.0851 -0.2177 0.1019 0.0886 0.0911 0.0958 0.0993 0.0955 0.1007 0.0959 0.1199 0.1177 0.0887 0.0943 0.0941 0.0991 0.0876 0.0954 0.1114 0.1028 0.1083 0.1234 0.1182 0.1153 0.1239 0.0942 0.0945 0.0831
va: 2.1369 2.0516 2.0406 3.6724 3.7908 3.8980 3.9046 3.9000 3.8613 4.1686 3.7064 3.7575 3.9280 3.9412 3.9328 3.6521 3.5739 4.0440 3.9396 3.9108 3.8336 3.9581 1.0231 1.0404 1.0026 1.0022 1.0028 1.0191 0.9995 1.0008 1.0073 0.9899 1.0078 0.9956 0.9962 0.9985 1.0082 0.9976 1.0225 1.0255 1.0084 0.9953 0.9962 1.0146 1.0331 0.9958 0.9955 1.0085
dispcorr: -0.022259383 hartree
energy: -965.455082648781
dipole: 21.85162 -19.71596 2.13566 5.16293 -6.54161 -1.37868 -8.70579 7.93911 -0.76668
magnitude: 2.65511 au
magnitude: 6.74875 debye
