program: Orca
programVersion: 5.0.2
elementType: O O O C C C C C C C C C C C C C C C C C C C H H H H H H H H H H H H H H H H H H H H H H H H H H
charge: 0
multiplicity: 1
keywords: wb97x-d3
keywords: def2-TZVPP
keywords: def2/J RIJCOSX
keywords: DEFGRID2
keywords: scfconv7
keywords: smallprint printgap noloewdin
keywords: NOSOSCF
formula: C19H26O3
InChI: InChI=1/C19H26O3/c1-7-8-13-12(4)16(10-15(13)20)22-18(21)17-14(9-11(2)3)19(17,5)6/h7-9,14,16-17H,10H2,1-6H3
48 atoms
O  -0.179645 -1.268908 1.148813
O  -0.051417 0.717188 0.131292
O  -4.462581 0.771892 1.466156
C  2.813411 0.69758 1.459474
C  2.917328 0.377927 -0.000356
C  1.941114 -0.394583 0.861616
C  3.906305 0.230428 2.389819
C  2.214684 2.019379 1.869433
C  4.076366 -0.342069 -0.571985
C  0.490943 -0.221644 0.66296
C  4.918766 0.12184 -1.499459
C  -1.60379 -1.302051 1.060496
C  6.045792 -0.728253 -2.004074
C  4.840536 1.488359 -2.106805
C  -2.351771 -0.304053 1.931994
C  -2.160125 -1.102346 -0.322207
C  -3.27539 -0.33909 -0.308793
C  -3.50991 0.136791 1.065272
C  -1.539884 -1.766217 -1.497176
C  -4.103648 -0.054954 -1.469701
C  -5.168461 0.751539 -1.527075
C  -5.963275 0.980904 -2.764788
H  2.451134 1.114321 -0.646967
H  2.236917 -1.403493 1.128277
H  4.279641 -0.762162 2.141254
H  4.752998 0.919363 2.355891
H  3.547675 0.198779 3.420372
H  1.695934 1.935598 2.82646
H  3.009672 2.757338 1.991858
H  1.512808 2.419249 1.141326
H  4.247259 -1.346028 -0.193991
H  -1.838613 -2.32273 1.37407
H  7.013153 -0.261771 -1.800024
H  6.04918 -1.719502 -1.551259
H  5.987628 -0.854384 -3.088215
H  4.734538 1.426795 -3.192323
H  4.018853 2.090201 -1.725113
H  5.765291 2.040418 -1.921361
H  -1.74504 0.569611 2.179752
H  -2.704928 -0.730698 2.870689
H  -0.844823 -2.550598 -1.20105
H  -0.981149 -1.041832 -2.094517
H  -2.287948 -2.210401 -2.154127
H  -3.805969 -0.559849 -2.384952
H  -5.501493 1.283474 -0.644845
H  -5.965025 2.039322 -3.036548
H  -5.581554 0.413092 -3.613368
H  -7.00944 0.704329 -2.613435
elementType: O C H
totalener: -965.43363951 hartree
nucrepener: 1790.14984399 hartree
electener: -2755.58348350 hartree
oneelecener: -4867.19426621 hartree
twoeener: 2111.61078271 hartree
cpcmener: -0.02885629 hartree
kineticenergy: 961.01430634 hartree
xcener: -95.148972615216 hartree
chargesum: 0.0000000
charge: -0.301641 -0.465440 -0.454764 0.129621 0.027624 -0.136851 -0.262001 -0.285436 -0.279619 0.404381 -0.038049 0.296290 -0.222751 -0.252176 -0.151247 -0.003659 -0.068159 0.273514 -0.286381 -0.239157 -0.085298 -0.217315 0.095786 0.086593 0.088160 0.096610 0.097338 0.098407 0.096055 0.093330 0.118030 0.118241 0.093550 0.088146 0.093085 0.095991 0.090344 0.095275 0.111449 0.102072 0.107991 0.123922 0.117929 0.114901 0.124018 0.094334 0.082975 0.093980
qa: -0.3016 -0.4654 -0.4548 0.1296 0.0276 -0.1369 -0.2620 -0.2854 -0.2796 0.4044 -0.0380 0.2963 -0.2228 -0.2522 -0.1512 -0.0037 -0.0682 0.2735 -0.2864 -0.2392 -0.0853 -0.2173 0.0958 0.0866 0.0882 0.0966 0.0973 0.0984 0.0961 0.0933 0.1180 0.1182 0.0936 0.0881 0.0931 0.0960 0.0903 0.0953 0.1114 0.1021 0.1080 0.1239 0.1179 0.1149 0.1240 0.0943 0.0830 0.0940
va: 2.1375 2.0487 2.0408 3.6842 3.7624 3.8954 3.9029 3.9053 3.8707 4.1573 3.7358 3.7598 3.9237 3.9445 3.9341 3.6549 3.5689 4.0411 3.9390 3.9113 3.8317 3.9576 1.0303 1.0419 1.0047 1.0027 1.0028 0.9995 1.0007 1.0192 1.0093 0.9908 0.9963 1.0087 0.9962 0.9973 1.0089 0.9973 1.0237 1.0259 1.0083 0.9950 0.9967 1.0150 1.0336 0.9956 1.0086 0.9960
dispcorr: -0.021816085 hartree
energy: -965.455455594168
dipole: 21.37785 -19.29151 2.08634 3.03054 -4.57274 -1.54220 -9.75749 9.18466 -0.57284
magnitude: 2.65695 au
magnitude: 6.75342 debye
