program: Orca
programVersion: 5.0.2
elementType: O O O C C C C C C C C C C C C C C C C C C C H H H H H H H H H H H H H H H H H H H H H H H H H H
charge: 0
multiplicity: 1
keywords: wb97x-d3
keywords: def2-TZVPP
keywords: def2/J RIJCOSX
keywords: DEFGRID2
keywords: scfconv7
keywords: smallprint printgap noloewdin
keywords: NOSOSCF
formula: C19H26O3
InChI: InChI=1/C19H26O3/c1-7-8-13-12(4)16(10-15(13)20)22-18(21)17-14(9-11(2)3)19(17,5)6/h7-9,14,16-17H,10H2,1-6H3
48 atoms
O  -0.311776 -0.540482 0.093099
O  0.84866 0.052321 -1.732855
O  -4.406588 -2.71148 0.238152
C  2.607898 1.479331 0.474133
C  3.296964 0.259077 -0.057915
C  1.866091 0.152986 0.429439
C  2.955406 1.986802 1.852433
C  2.265875 2.585807 -0.49264
C  4.3687 -0.447483 0.670701
C  0.782546 -0.103426 -0.53683
C  5.540623 -0.802033 0.135386
C  -1.474566 -0.903186 -0.658472
C  6.569478 -1.540051 0.934984
C  5.908136 -0.498787 -1.29373
C  -2.065002 -2.204974 -0.141797
C  -2.559181 0.125884 -0.471976
C  -3.722993 -0.441225 -0.092555
C  -3.532713 -1.897712 0.031071
C  -2.283315 1.552848 -0.764275
C  -5.033608 0.155875 0.122454
C  -5.270389 1.388923 0.577091
C  -6.630005 1.967664 0.762745
H  3.394439 0.249375 -1.138964
H  1.720774 -0.312764 1.398096
H  3.859619 2.598385 1.818405
H  2.149664 2.610973 2.244146
H  3.125135 1.184904 2.570112
H  2.10122 2.23506 -1.509175
H  1.372293 3.126943 -0.173646
H  3.087493 3.304313 -0.527662
H  4.174537 -0.700696 1.708755
H  -1.221282 -0.975673 -1.718756
H  6.820093 -2.495082 0.464677
H  7.50281 -0.973382 0.99429
H  6.234572 -1.744539 1.952142
H  5.803132 0.561126 -1.531382
H  6.941635 -0.775059 -1.502764
H  5.282306 -1.047677 -2.001421
H  -1.64566 -2.470315 0.832321
H  -1.907733 -3.052446 -0.809212
H  -1.885045 2.063255 0.11666
H  -3.18666 2.084709 -1.063352
H  -1.541735 1.657535 -1.556886
H  -5.881431 -0.488917 -0.094207
H  -4.439634 2.03019 0.854437
H  -7.416836 1.257395 0.508727
H  -6.78118 2.292218 1.794831
H  -6.761646 2.85612 0.139966
elementType: O C H
totalener: -965.43519220 hartree
nucrepener: 1760.18184200 hartree
electener: -2725.61703420 hartree
oneelecener: -4806.57859934 hartree
twoeener: 2080.96156513 hartree
cpcmener: -0.02789209 hartree
kineticenergy: 960.98961583 hartree
xcener: -95.140831331825 hartree
chargesum: -0.0000000
charge: -0.289357 -0.469234 -0.445514 0.113957 0.045149 -0.123296 -0.267563 -0.279207 -0.303441 0.399751 -0.010054 0.243590 -0.220941 -0.284380 -0.132998 -0.030923 -0.004298 0.278753 -0.295644 -0.243987 -0.084353 -0.214164 0.092494 0.089448 0.097393 0.096730 0.087649 0.093104 0.095024 0.097574 0.117199 0.103648 0.097777 0.095688 0.084436 0.103496 0.095006 0.103146 0.101438 0.097437 0.123646 0.118587 0.108671 0.111277 0.130424 0.086697 0.095605 0.094563
qa: -0.2894 -0.4692 -0.4455 0.1140 0.0451 -0.1233 -0.2676 -0.2792 -0.3034 0.3998 -0.0101 0.2436 -0.2209 -0.2844 -0.1330 -0.0309 -0.0043 0.2788 -0.2956 -0.2440 -0.0844 -0.2142 0.0925 0.0894 0.0974 0.0967 0.0876 0.0931 0.0950 0.0976 0.1172 0.1036 0.0978 0.0957 0.0844 0.1035 0.0950 0.1031 0.1014 0.0974 0.1236 0.1186 0.1087 0.1113 0.1304 0.0867 0.0956 0.0946
va: 2.1235 2.0350 2.0558 3.6921 3.7615 3.8837 3.9092 3.9060 3.8936 4.1739 3.6967 3.7716 3.9209 3.9411 3.9275 3.7249 3.4657 4.0720 3.9328 3.8921 3.8535 3.9512 1.0294 1.0372 1.0017 1.0025 1.0059 1.0182 1.0007 1.0010 1.0101 1.0319 0.9926 0.9932 1.0103 0.9956 1.0048 0.9966 1.0267 1.0265 0.9919 0.9993 1.0163 1.0292 0.9991 1.0084 0.9963 0.9971
dispcorr: -0.021364917 hartree
energy: -965.456557118691
dipole: 19.36761 -18.00145 1.36616 14.27174 -12.49036 1.78138 3.58458 -3.06137 0.52321
magnitude: 2.30510 au
magnitude: 5.85909 debye
