program: Orca
programVersion: 5.0.2
elementType: O O O C C C C C C C C C C C C C C C C C C C H H H H H H H H H H H H H H H H H H H H H H H H H H
charge: 0
multiplicity: 1
keywords: wb97x-d3
keywords: def2-TZVPP
keywords: def2/J RIJCOSX
keywords: DEFGRID2
keywords: scfconv7
keywords: smallprint printgap noloewdin
keywords: NOSOSCF
formula: C19H26O3
InChI: InChI=1/C19H26O3/c1-7-8-13-12(4)16(10-15(13)20)22-18(21)17-14(9-11(2)3)19(17,5)6/h7-9,14,16-17H,10H2,1-6H3
48 atoms
O  -0.311022 -0.607626 0.026525
O  0.837414 0.064242 -1.779086
O  -4.403033 -2.668945 0.382305
C  2.527446 1.467579 0.517375
C  3.275945 0.315016 -0.082948
C  1.850672 0.112561 0.388844
C  2.836938 1.913522 1.925626
C  2.130996 2.608335 -0.387336
C  4.365448 -0.391885 0.619547
C  0.773662 -0.130704 -0.588742
C  5.559007 -0.722419 0.114844
C  -1.471566 -0.967881 -0.732472
C  6.55738 -1.475055 0.943017
C  6.024366 -0.399187 -1.271743
C  -2.082784 -2.244571 -0.177476
C  -2.539703 0.085264 -0.576666
C  -3.695013 -0.439106 -0.121007
C  -3.527976 -1.889853 0.073187
C  -2.258343 1.488192 -0.963931
C  -4.978146 0.205578 0.127805
C  -5.140693 1.427245 0.640191
C  -6.46051 2.074239 0.878017
H  3.376349 0.377265 -1.161302
H  1.725974 -0.415317 1.328225
H  1.992174 2.464953 2.343603
H  3.048609 1.083664 2.598837
H  3.702396 2.57936 1.936558
H  1.979662 2.306575 -1.421705
H  1.212841 3.085822 -0.037692
H  2.915297 3.368109 -0.383558
H  4.158516 -0.683253 1.645502
H  -1.206525 -1.073718 -1.786877
H  6.842934 -2.411585 0.456089
H  7.479178 -0.900635 1.068821
H  6.174276 -1.716704 1.934555
H  6.958473 0.166668 -1.235633
H  6.242777 -1.313485 -1.828561
H  5.312463 0.182058 -1.853142
H  -1.618436 -2.533842 0.768465
H  -1.99699 -3.094192 -0.855571
H  -3.173324 2.044559 -1.164284
H  -1.625542 1.527781 -1.851441
H  -1.724389 2.015744 -0.169197
H  -5.85905 -0.387505 -0.104439
H  -4.267695 2.00508 0.929047
H  -7.291776 1.429819 0.592121
H  -6.581637 2.343306 1.929834
H  -6.543357 3.00552 0.312164
elementType: O C H
totalener: -965.43656658 hartree
nucrepener: 1762.17696881 hartree
electener: -2727.61353539 hartree
oneelecener: -4810.57524146 hartree
twoeener: 2082.96170607 hartree
cpcmener: -0.02833936 hartree
kineticenergy: 960.99571353 hartree
xcener: -95.141907350217 hartree
chargesum: -0.0000000
charge: -0.286477 -0.467747 -0.444309 0.109839 0.036113 -0.103230 -0.267347 -0.277350 -0.276769 0.391013 -0.048628 0.240835 -0.218106 -0.250910 -0.133667 -0.037974 0.000026 0.275366 -0.287994 -0.242767 -0.090188 -0.215216 0.091062 0.089389 0.096812 0.087534 0.097459 0.093164 0.094297 0.099086 0.115794 0.104493 0.092587 0.093007 0.087785 0.094529 0.096412 0.089228 0.101171 0.098883 0.117718 0.111640 0.121002 0.115531 0.129006 0.086987 0.096128 0.094782
qa: -0.2865 -0.4677 -0.4443 0.1098 0.0361 -0.1032 -0.2673 -0.2774 -0.2768 0.3910 -0.0486 0.2408 -0.2181 -0.2509 -0.1337 -0.0380 0.0000 0.2754 -0.2880 -0.2428 -0.0902 -0.2152 0.0911 0.0894 0.0968 0.0875 0.0975 0.0932 0.0943 0.0991 0.1158 0.1045 0.0926 0.0930 0.0878 0.0945 0.0964 0.0892 0.1012 0.0989 0.1177 0.1116 0.1210 0.1155 0.1290 0.0870 0.0961 0.0948
va: 2.1237 2.0387 2.0583 3.6911 3.7788 3.8441 3.9059 3.9036 3.8767 4.1875 3.7663 3.7715 3.9215 3.9420 3.9133 3.7329 3.4544 4.0827 3.9289 3.8807 3.8563 3.9508 1.0338 1.0368 1.0019 1.0061 1.0020 1.0177 1.0013 1.0013 1.0116 1.0298 0.9961 0.9964 1.0091 0.9974 0.9967 1.0103 1.0281 1.0252 1.0012 1.0141 0.9930 1.0247 1.0007 1.0085 0.9962 0.9970
dispcorr: -0.021406459 hartree
energy: -965.457973036987
dipole: 19.50862 -18.14975 1.35887 14.39954 -12.70921 1.69033 3.88282 -3.47398 0.40884
magnitude: 2.20701 au
magnitude: 5.60977 debye
