program: Orca
programVersion: 5.0.2
elementType: O O O C C C C C C C C C C C C C C C C C C C H H H H H H H H H H H H H H H H H H H H H H H H H H
charge: 0
multiplicity: 1
keywords: wb97x-d3
keywords: def2-TZVPP
keywords: def2/J RIJCOSX
keywords: DEFGRID2
keywords: scfconv7
keywords: smallprint printgap noloewdin
keywords: NOSOSCF
formula: C19H26O3
InChI: InChI=1/C19H26O3/c1-7-8-13-12(4)16(10-15(13)20)22-18(21)17-14(9-11(2)3)19(17,5)6/h7-9,14,16-17H,10H2,1-6H3
48 atoms
O  -0.315598 -0.553165 0.053744
O  0.848823 0.052079 -1.765092
O  -4.416321 -2.709726 0.172988
C  2.588706 1.485089 0.439267
C  3.290133 0.268188 -0.084583
C  1.858202 0.152432 0.400377
C  2.931432 2.008078 1.813315
C  2.225762 2.582522 -0.531418
C  4.357745 -0.423437 0.66486
C  0.778697 -0.106805 -0.569731
C  5.537528 -0.828824 0.182999
C  -1.478954 -0.900146 -0.704888
C  6.521288 -1.536718 1.066224
C  6.001809 -0.633228 -1.228074
C  -2.074037 -2.209341 -0.212713
C  -2.558801 0.130435 -0.496797
C  -3.721517 -0.437826 -0.117671
C  -3.538647 -1.897407 -0.024052
C  -2.278306 1.560298 -0.770364
C  -5.025936 0.160777 0.130327
C  -5.246661 1.362948 0.667372
C  -6.600011 1.935934 0.908724
H  3.388187 0.251158 -1.164609
H  1.712262 -0.312008 1.369633
H  3.096311 1.216456 2.543195
H  3.837367 2.61676 1.773914
H  2.126269 2.639986 2.193377
H  2.11458 2.233917 -1.555973
H  1.295316 3.075074 -0.239193
H  3.01027 3.342321 -0.531911
H  4.148571 -0.626497 1.711345
H  -1.225742 -0.953834 -1.766103
H  7.46601 -0.988988 1.122342
H  6.147335 -1.665272 2.082129
H  6.763095 -2.526782 0.669716
H  6.933222 -0.060915 -1.247227
H  6.225304 -1.595063 -1.697512
H  5.286324 -0.113861 -1.862519
H  -1.650239 -2.500395 0.751996
H  -1.926715 -3.041977 -0.900785
H  -1.82154 2.043534 0.097624
H  -3.187308 2.112931 -1.007105
H  -1.578977 1.67106 -1.600341
H  -5.881522 -0.460187 -0.122643
H  -4.406399 1.975717 0.979728
H  -7.393514 1.261854 0.585543
H  -6.748392 2.154882 1.968966
H  -6.723344 2.884136 0.379582
elementType: O C H
totalener: -965.43665246 hartree
nucrepener: 1759.44302294 hartree
electener: -2724.87967540 hartree
oneelecener: -4805.08985060 hartree
twoeener: 2080.21017520 hartree
cpcmener: -0.02822132 hartree
kineticenergy: 960.98556469 hartree
xcener: -95.140532048348 hartree
chargesum: 0.0000000
charge: -0.289564 -0.468177 -0.445190 0.106916 0.037277 -0.099820 -0.268237 -0.276836 -0.278145 0.391010 -0.049679 0.243409 -0.217600 -0.250988 -0.132649 -0.033964 0.000269 0.278243 -0.293355 -0.244779 -0.085589 -0.214650 0.092513 0.089084 0.087486 0.097470 0.096563 0.093602 0.095511 0.097390 0.116699 0.103800 0.092731 0.087811 0.092912 0.095544 0.095813 0.089272 0.101433 0.097414 0.122310 0.117838 0.110012 0.112235 0.129935 0.086616 0.095723 0.094379
qa: -0.2896 -0.4682 -0.4452 0.1069 0.0373 -0.0998 -0.2682 -0.2768 -0.2781 0.3910 -0.0497 0.2434 -0.2176 -0.2510 -0.1326 -0.0340 0.0003 0.2782 -0.2934 -0.2448 -0.0856 -0.2147 0.0925 0.0891 0.0875 0.0975 0.0966 0.0936 0.0955 0.0974 0.1167 0.1038 0.0927 0.0878 0.0929 0.0955 0.0958 0.0893 0.1014 0.0974 0.1223 0.1178 0.1100 0.1122 0.1299 0.0866 0.0957 0.0944
va: 2.1229 2.0376 2.0563 3.6871 3.7765 3.8468 3.9086 3.9047 3.8741 4.1827 3.7681 3.7696 3.9213 3.9415 3.9233 3.7259 3.4600 4.0743 3.9316 3.8868 3.8531 3.9517 1.0335 1.0369 1.0064 1.0016 1.0021 1.0178 1.0002 1.0011 1.0112 1.0322 0.9964 1.0091 0.9962 0.9972 0.9968 1.0106 1.0267 1.0265 0.9926 1.0003 1.0146 1.0282 1.0000 1.0085 0.9960 0.9973
dispcorr: -0.021301039 hartree
energy: -965.457953497855
dipole: 19.49629 -18.11694 1.37935 14.04653 -12.27918 1.76735 4.36170 -3.76416 0.59753
magnitude: 2.32016 au
magnitude: 5.89739 debye
