program: Orca
programVersion: 5.0.2
elementType: O O O C C C C C C C C C C C C C C C C C C C H H H H H H H H H H H H H H H H H H H H H H H H H H
charge: 0
multiplicity: 1
keywords: wb97x-d3
keywords: def2-TZVPP
keywords: def2/J RIJCOSX
keywords: DEFGRID2
keywords: scfconv7
keywords: smallprint printgap noloewdin
keywords: NOSOSCF
formula: C19H26O3
InChI: InChI=1/C19H26O3/c1-7-8-13-12(4)16(10-15(13)20)22-18(21)17-14(9-11(2)3)19(17,5)6/h7-9,14,16-17H,10H2,1-6H3
48 atoms
O  -0.090688 -0.273794 -0.076409
O  0.940989 0.59062 -1.870854
O  -3.905312 -2.896421 -0.027602
C  2.754973 1.901786 0.355616
C  3.446892 0.740584 -0.269124
C  2.035468 0.562477 0.255605
C  3.135985 2.312411 1.75742
C  2.340099 3.065179 -0.510846
C  4.577873 0.035972 0.388748
C  0.936192 0.319972 -0.692983
C  4.778565 -1.283978 0.358069
C  -1.241237 -0.67452 -0.826404
C  5.958022 -1.910538 1.03603
C  3.8572 -2.243055 -0.331659
C  -1.661046 -2.087281 -0.455553
C  -2.41807 0.196005 -0.471093
C  -3.491808 -0.538958 -0.113774
C  -3.139115 -1.969272 -0.175846
C  -2.309348 1.669167 -0.598111
C  -4.844388 -0.125783 0.230644
C  -5.19634 1.026595 0.806846
C  -6.60043 1.410599 1.119709
H  3.501843 0.786334 -1.354779
H  1.939124 0.031213 1.195726
H  3.396587 1.46225 2.388278
H  3.992622 2.989769 1.741579
H  2.310533 2.8394 2.239977
H  2.139111 2.784121 -1.542239
H  1.447187 3.553136 -0.114206
H  3.138593 3.809837 -0.527916
H  5.302252 0.657172 0.908979
H  -1.035135 -0.587866 -1.895785
H  5.6383 -2.662393 1.762718
H  6.594441 -2.430601 0.315112
H  6.572029 -1.176981 1.558637
H  3.345476 -2.879879 0.395697
H  3.097793 -1.75342 -0.938446
H  4.419635 -2.915303 -0.984482
H  -1.157372 -2.424647 0.454183
H  -1.458333 -2.82248 -1.234558
H  -3.272233 2.125391 -0.829387
H  -1.59893 1.947854 -1.376975
H  -1.95556 2.117933 0.333719
H  -5.623925 -0.848075 0.002883
H  -4.433241 1.742575 1.094796
H  -7.310008 0.630331 0.844488
H  -6.721737 1.624126 2.184298
H  -6.880041 2.325102 0.590529
elementType: O C H
totalener: -965.43491794 hartree
nucrepener: 1783.67476313 hartree
electener: -2749.10968107 hartree
oneelecener: -4853.53235863 hartree
twoeener: 2104.42267756 hartree
cpcmener: -0.02702983 hartree
kineticenergy: 960.99755333 hartree
xcener: -95.142399017213 hartree
chargesum: 0.0000000
charge: -0.291858 -0.473818 -0.446038 0.147118 -0.017638 -0.114346 -0.283416 -0.279902 -0.298983 0.394476 -0.009628 0.241302 -0.227642 -0.243345 -0.130873 -0.028348 -0.007810 0.280427 -0.300016 -0.242716 -0.084207 -0.212673 0.104525 0.094193 0.092843 0.098457 0.097132 0.093302 0.096520 0.096190 0.121315 0.103794 0.092871 0.096600 0.089186 0.101340 0.082503 0.100674 0.101041 0.097166 0.118855 0.109650 0.124158 0.110199 0.131345 0.086149 0.095493 0.094432
qa: -0.2919 -0.4738 -0.4460 0.1471 -0.0176 -0.1143 -0.2834 -0.2799 -0.2990 0.3945 -0.0096 0.2413 -0.2276 -0.2433 -0.1309 -0.0283 -0.0078 0.2804 -0.3000 -0.2427 -0.0842 -0.2127 0.1045 0.0942 0.0928 0.0985 0.0971 0.0933 0.0965 0.0962 0.1213 0.1038 0.0929 0.0966 0.0892 0.1013 0.0825 0.1007 0.1010 0.0972 0.1189 0.1097 0.1242 0.1102 0.1313 0.0861 0.0955 0.0944
va: 2.1142 2.0285 2.0552 3.7049 3.8119 3.8236 3.9052 3.8929 3.8914 4.1451 3.7033 3.7740 3.9324 3.9372 3.9262 3.7208 3.4727 4.0687 3.9374 3.8939 3.8525 3.9514 1.0261 1.0314 1.0024 1.0000 1.0031 1.0181 0.9998 1.0016 1.0040 1.0327 0.9965 0.9962 1.0063 0.9981 1.0131 1.0001 1.0268 1.0266 0.9984 1.0158 0.9916 1.0301 0.9988 1.0085 0.9962 0.9971
dispcorr: -0.022177837 hartree
energy: -965.457095776973
dipole: 14.25498 -13.16863 1.08635 10.31992 -8.75038 1.56954 6.89489 -6.09731 0.79759
magnitude: 2.06875 au
magnitude: 5.25835 debye
