program: Orca
programVersion: 5.0.2
elementType: O O O C C C C C C C C C C C C C C C C C C C H H H H H H H H H H H H H H H H H H H H H H H H H H
charge: 0
multiplicity: 1
keywords: wb97x-d3
keywords: def2-TZVPP
keywords: def2/J RIJCOSX
keywords: DEFGRID2
keywords: scfconv7
keywords: smallprint printgap noloewdin
keywords: NOSOSCF
formula: C19H26O3
InChI: InChI=1/C19H26O3/c1-7-8-13-12(4)16(10-15(13)20)22-18(21)17-14(9-11(2)3)19(17,5)6/h7-9,14,16-17H,10H2,1-6H3
48 atoms
O  -0.29004 -0.57474 0.161298
O  0.762319 0.113419 -1.694985
O  -4.414564 -2.661013 0.461584
C  2.653964 1.412768 0.478371
C  3.314209 0.211157 -0.12975
C  1.905032 0.091661 0.41015
C  3.061922 1.861258 1.860015
C  2.281299 2.558289 -0.430129
C  4.409435 -0.521833 0.538986
C  0.769408 -0.108862 -0.508024
C  5.606571 -0.75847 -0.004901
C  -1.502935 -0.863074 -0.534955
C  6.657688 -1.530511 0.731773
C  5.982466 -0.290081 -1.385689
C  -2.093762 -2.176671 -0.046956
C  -2.554485 0.177072 -0.232659
C  -3.725109 -0.395663 0.116331
C  -3.544737 -1.854736 0.211562
C  -2.249597 1.619916 -0.383233
C  -5.018855 0.210226 0.403607
C  -5.514626 1.30169 -0.183557
C  -6.837834 1.903789 0.138352
H  3.373862 0.244521 -1.213212
H  1.799279 -0.41458 1.363673
H  2.275812 2.46962 2.311799
H  3.259605 1.029204 2.534865
H  3.965867 2.472098 1.813527
H  2.071304 2.247609 -1.451189
H  1.407561 3.094787 -0.053404
H  3.107364 3.271079 -0.472783
H  4.21213 -0.892529 1.540662
H  -1.315793 -0.887963 -1.611335
H  7.5586 -0.927678 0.875419
H  6.315965 -1.864631 1.711577
H  6.966938 -2.41272 0.164144
H  5.716455 0.753726 -1.558302
H  7.055594 -0.383203 -1.554781
H  5.487639 -0.880111 -2.161612
H  -1.629786 -2.487172 0.892936
H  -1.985122 -2.99806 -0.755109
H  -2.97037 2.244225 0.142175
H  -2.2640 1.90957 -1.437382
H  -1.25557 1.861109 -0.003896
H  -5.626545 -0.306599 1.141789
H  -4.944407 1.798276 -0.9626
H  -6.71796 2.920804 0.520357
H  -7.459885 1.984358 -0.755918
H  -7.382874 1.324825 0.883717
elementType: O C H
totalener: -965.43516889 hartree
nucrepener: 1758.42998522 hartree
electener: -2723.86515411 hartree
oneelecener: -4803.07417984 hartree
twoeener: 2079.20902572 hartree
cpcmener: -0.02847601 hartree
kineticenergy: 960.98956029 hartree
xcener: -95.141051223411 hartree
chargesum: -0.0000000
charge: -0.293181 -0.466286 -0.445314 0.122782 0.040604 -0.116225 -0.263824 -0.285538 -0.303780 0.376745 -0.010174 0.274987 -0.220049 -0.284262 -0.143528 -0.057698 -0.002509 0.277176 -0.275039 -0.236122 -0.090543 -0.213996 0.095061 0.088354 0.097410 0.087382 0.096825 0.095018 0.093368 0.099628 0.118522 0.101774 0.094223 0.084278 0.098553 0.101955 0.094630 0.105410 0.101007 0.098526 0.113513 0.123195 0.105054 0.116429 0.129033 0.094544 0.095796 0.086284
qa: -0.2932 -0.4663 -0.4453 0.1228 0.0406 -0.1162 -0.2638 -0.2855 -0.3038 0.3767 -0.0102 0.2750 -0.2200 -0.2843 -0.1435 -0.0577 -0.0025 0.2772 -0.2750 -0.2361 -0.0905 -0.2140 0.0951 0.0884 0.0974 0.0874 0.0968 0.0950 0.0934 0.0996 0.1185 0.1018 0.0942 0.0843 0.0986 0.1020 0.0946 0.1054 0.1010 0.0985 0.1135 0.1232 0.1051 0.1164 0.1290 0.0945 0.0958 0.0863
va: 2.1230 2.0362 2.0566 3.6821 3.7673 3.8860 3.9065 3.9043 3.8907 4.1912 3.6963 3.7253 3.9227 3.9419 3.9303 3.7847 3.4454 4.0854 3.9466 3.8739 3.8627 3.9516 1.0273 1.0385 1.0024 1.0054 1.0022 1.0180 1.0019 1.0016 1.0092 1.0321 0.9940 1.0103 0.9926 0.9962 1.0042 0.9957 1.0275 1.0249 1.0002 0.9928 1.0071 1.0235 1.0000 0.9967 0.9964 1.0086
dispcorr: -0.021479093 hartree
energy: -965.456647987925
dipole: 19.55403 -18.15602 1.39801 14.22333 -12.47907 1.74426 1.98393 -1.67649 0.30744
magnitude: 2.25641 au
magnitude: 5.73534 debye
