program: Orca
programVersion: 5.0.2
elementType: O O O C C C C C C C C C C C C C C C C C C C H H H H H H H H H H H H H H H H H H H H H H H H H H
charge: 0
multiplicity: 1
keywords: wb97x-d3
keywords: def2-TZVPP
keywords: def2/J RIJCOSX
keywords: DEFGRID2
keywords: scfconv7
keywords: smallprint printgap noloewdin
keywords: NOSOSCF
formula: C19H26O3
InChI: InChI=1/C19H26O3/c1-7-8-13-12(4)16(10-15(13)20)22-18(21)17-14(9-11(2)3)19(17,5)6/h7-9,14,16-17H,10H2,1-6H3
48 atoms
O  -0.103976 -0.138331 -0.175153
O  0.988372 0.643096 -1.970931
O  -3.792119 -2.91619 -0.210963
C  2.850983 1.930874 0.207885
C  3.471054 0.683029 -0.319374
C  2.038931 0.643591 0.178383
C  3.238142 2.407548 1.587122
C  2.533746 3.060866 -0.740292
C  4.530011 -0.053177 0.420005
C  0.952613 0.406476 -0.786521
C  4.590478 -1.379912 0.561256
C  -1.24781 -0.531825 -0.939344
C  5.701128 -2.033524 1.325396
C  3.572722 -2.321878 -0.006401
C  -1.603479 -1.987921 -0.68559
C  -2.444273 0.258148 -0.481458
C  -3.468923 -0.544947 -0.129866
C  -3.067772 -1.950936 -0.321227
C  -2.396492 1.739284 -0.515901
C  -4.814836 -0.213182 0.314233
C  -5.163031 0.860064 1.027996
C  -6.555539 1.162724 1.45919
H  3.554712 0.649481 -1.403718
H  1.884046 0.181729 1.146807
H  3.415933 1.58568 2.28123
H  4.149107 3.008736 1.543121
H  2.451997 3.034392 2.012804
H  2.366037 2.731772 -1.762989
H  1.648452 3.610085 -0.413963
H  3.366542 3.76631 -0.759403
H  5.320531 0.549328 0.859866
H  -1.068127 -0.341972 -1.999808
H  6.269225 -2.715473 0.68738
H  6.396801 -1.307151 1.74582
H  5.307024 -2.637551 2.147253
H  2.865317 -1.84158 -0.679147
H  4.062184 -3.125517 -0.561897
H  3.002118 -2.804159 0.792194
H  -1.037921 -2.397628 0.155168
H  -1.425845 -2.634407 -1.54535
H  -1.740983 2.090755 -1.313854
H  -2.003125 2.142256 0.420453
H  -3.386207 2.172018 -0.663349
H  -5.58528 -0.932921 0.050875
H  -4.402049 1.564412 1.348902
H  -7.261366 0.400097 1.130616
H  -6.620151 1.242623 2.546826
H  -6.885798 2.125336 1.06116
elementType: O C H
totalener: -965.43474577 hartree
nucrepener: 1785.21440903 hartree
electener: -2750.64915480 hartree
oneelecener: -4856.60533151 hartree
twoeener: 2105.95617671 hartree
cpcmener: -0.02724268 hartree
kineticenergy: 961.00654774 hartree
xcener: -95.143639725084 hartree
chargesum: -0.0000000
charge: -0.293519 -0.473411 -0.445624 0.140324 -0.008191 -0.115107 -0.281244 -0.282503 -0.302131 0.392938 -0.011737 0.241254 -0.227627 -0.242412 -0.133588 -0.026796 -0.007680 0.284661 -0.301281 -0.242477 -0.084322 -0.213007 0.104923 0.095499 0.092548 0.097991 0.097037 0.093742 0.097821 0.094944 0.121281 0.104450 0.096182 0.088962 0.093741 0.084418 0.101829 0.101522 0.099947 0.098579 0.111246 0.121538 0.118091 0.111084 0.130251 0.086143 0.095707 0.094004
qa: -0.2935 -0.4734 -0.4456 0.1403 -0.0082 -0.1151 -0.2812 -0.2825 -0.3021 0.3929 -0.0117 0.2413 -0.2276 -0.2424 -0.1336 -0.0268 -0.0077 0.2847 -0.3013 -0.2425 -0.0843 -0.2130 0.1049 0.0955 0.0925 0.0980 0.0970 0.0937 0.0978 0.0949 0.1213 0.1045 0.0962 0.0890 0.0937 0.0844 0.1018 0.1015 0.0999 0.0986 0.1112 0.1215 0.1181 0.1111 0.1303 0.0861 0.0957 0.0940
va: 2.1098 2.0333 2.0561 3.7041 3.8013 3.8219 3.9059 3.8956 3.8939 4.1451 3.7101 3.7649 3.9319 3.9354 3.9228 3.7113 3.4765 4.0674 3.9429 3.8891 3.8520 3.9518 1.0252 1.0304 1.0027 1.0001 1.0033 1.0187 0.9990 1.0015 1.0044 1.0351 0.9965 1.0064 0.9966 1.0112 1.0000 0.9984 1.0267 1.0260 1.0112 0.9926 0.9986 1.0290 0.9995 1.0085 0.9961 0.9973
dispcorr: -0.022177599 hartree
energy: -965.456923368425
dipole: 13.62366 -12.65760 0.96606 9.67660 -8.06100 1.61560 8.48263 -7.53451 0.94812
magnitude: 2.10769 au
magnitude: 5.35733 debye
