program: Orca
programVersion: 5.0.2
elementType: O O O C C C C C C C C C C C C C C C C C C C H H H H H H H H H H H H H H H H H H H H H H H H H H
charge: 0
multiplicity: 1
keywords: wb97x-d3
keywords: def2-TZVPP
keywords: def2/J RIJCOSX
keywords: DEFGRID2
keywords: scfconv7
keywords: smallprint printgap noloewdin
keywords: NOSOSCF
formula: C19H26O3
InChI: InChI=1/C19H26O3/c1-7-8-13-12(4)16(10-15(13)20)22-18(21)17-14(9-11(2)3)19(17,5)6/h7-9,14,16-17H,10H2,1-6H3
48 atoms
O  0.039612 0.654259 -0.796382
O  0.531775 2.823177 -1.057633
O  -3.979059 -1.490022 -1.577869
C  3.05817 0.319578 -1.489698
C  2.733586 -0.024528 -0.065078
C  2.292238 1.310476 -0.629157
C  4.466833 0.717979 -1.85858
C  2.359178 -0.441046 -2.590394
C  3.749585 -0.035942 1.007039
C  0.881529 1.683984 -0.854172
C  3.963663 -1.016064 1.890702
C  -1.360368 0.853043 -1.009996
C  5.011851 -0.871052 2.952895
C  3.213074 -2.312622 1.93013
C  -1.930256 -0.251707 -1.880464
C  -2.101032 0.739405 0.296169
C  -3.128788 -0.135637 0.223957
C  -3.146473 -0.73453 -1.126198
C  -1.675685 1.571934 1.447005
C  -4.072781 -0.427703 1.29179
C  -5.056108 -1.33385 1.278942
C  -5.973974 -1.563832 2.42904
H  1.941635 -0.757339 0.03752
H  2.879361 2.169785 -0.321946
H  4.945758 1.340788 -1.103856
H  5.0892 -0.168251 -2.000149
H  4.473448 1.277789 -2.795986
H  1.396403 -0.849281 -2.289961
H  2.19908 0.191649 -3.466218
H  2.980179 -1.282092 -2.905909
H  4.367847 0.854023 1.08502
H  -1.53349 1.838234 -1.449402
H  5.767453 -1.657288 2.871655
H  5.521599 0.091077 2.901625
H  4.575123 -0.967012 3.950923
H  3.908394 -3.155793 1.928541
H  2.632778 -2.397291 2.853003
H  2.529236 -2.452216 1.094875
H  -1.227653 -1.083865 -1.975324
H  -2.190619 0.074311 -2.887488
H  -0.691253 1.258792 1.80467
H  -2.362053 1.517933 2.288704
H  -1.582112 2.618723 1.150101
H  -3.948162 0.160265 2.196512
H  -5.223735 -1.952014 0.406301
H  -5.922442 -2.601234 2.768646
H  -5.745348 -0.917034 3.276369
H  -7.013367 -1.390057 2.139152
elementType: O C H
totalener: -965.43466277 hartree
nucrepener: 1792.60844005 hartree
electener: -2758.04310282 hartree
oneelecener: -4871.22107669 hartree
twoeener: 2113.17797387 hartree
cpcmener: -0.02813906 hartree
kineticenergy: 960.99094232 hartree
xcener: -95.143473947081 hartree
chargesum: -0.0000000
charge: -0.283560 -0.464473 -0.445933 0.098873 0.076704 -0.130059 -0.270951 -0.272161 -0.300387 0.409415 -0.039271 0.225924 -0.221780 -0.254779 -0.138992 -0.021565 -0.038071 0.280256 -0.244177 -0.242415 -0.080087 -0.216022 0.093857 0.089596 0.087814 0.096677 0.097682 0.085408 0.100797 0.096553 0.116208 0.108923 0.093687 0.087741 0.092464 0.093899 0.098254 0.089660 0.103907 0.098901 0.110132 0.103761 0.112254 0.118116 0.126156 0.094057 0.082528 0.094478
qa: -0.2836 -0.4645 -0.4459 0.0989 0.0767 -0.1301 -0.2710 -0.2722 -0.3004 0.4094 -0.0393 0.2259 -0.2218 -0.2548 -0.1390 -0.0216 -0.0381 0.2803 -0.2442 -0.2424 -0.0801 -0.2160 0.0939 0.0896 0.0878 0.0967 0.0977 0.0854 0.1008 0.0966 0.1162 0.1089 0.0937 0.0877 0.0925 0.0939 0.0983 0.0897 0.1039 0.0989 0.1101 0.1038 0.1123 0.1181 0.1262 0.0941 0.0825 0.0945
va: 2.1073 2.0407 2.0505 3.7076 3.7108 3.8797 3.9112 3.9131 3.8708 4.1743 3.7547 3.7596 3.9245 3.9436 3.9659 3.7273 3.5406 4.0541 3.9387 3.9141 3.8215 3.9590 1.0299 1.0341 1.0061 1.0019 1.0017 1.0116 0.9998 1.0013 1.0114 1.0340 0.9965 1.0090 0.9957 0.9979 0.9961 1.0093 1.0235 1.0240 0.9992 1.0106 1.0056 1.0186 1.0335 0.9960 1.0084 0.9961
dispcorr: -0.021819060 hartree
energy: -965.456481826329
dipole: 16.38917 -14.99199 1.39718 -7.70250 7.45224 -0.25026 11.13909 -10.00218 1.13690
magnitude: 1.81860 au
magnitude: 4.62251 debye
