program: Orca
programVersion: 5.0.2
elementType: O O O C C C C C C C C C C C C C C C C C C C H H H H H H H H H H H H H H H H H H H H H H H H H H
charge: 0
multiplicity: 1
keywords: wb97x-d3
keywords: def2-TZVPP
keywords: def2/J RIJCOSX
keywords: DEFGRID2
keywords: scfconv7
keywords: smallprint printgap noloewdin
keywords: NOSOSCF
formula: C19H26O3
InChI: InChI=1/C19H26O3/c1-7-8-13-12(4)16(10-15(13)20)22-18(21)17-14(9-11(2)3)19(17,5)6/h7-9,14,16-17H,10H2,1-6H3
48 atoms
O  0.050253 0.667826 -0.813612
O  0.542263 2.845313 -0.989008
O  -4.046578 -1.350272 -1.626383
C  3.048739 0.298862 -1.50244
C  2.749561 -0.01067 -0.065172
C  2.307474 1.316761 -0.651834
C  4.453924 0.67911 -1.903938
C  2.329569 -0.483696 -2.574387
C  3.783547 -0.017987 0.988211
C  0.893787 1.69803 -0.839673
C  3.926744 -0.9764 1.908234
C  -1.353284 0.880162 -0.985198
C  4.992385 -0.890424 2.9569
C  3.036488 -2.190107 1.967761
C  -1.952646 -0.178799 -1.892454
C  -2.065225 0.709991 0.33037
C  -3.113174 -0.138453 0.23503
C  -3.175436 -0.658525 -1.14624
C  -1.596531 1.470723 1.513764
C  -4.038892 -0.47113 1.306978
C  -5.034303 -1.36329 1.268923
C  -5.930473 -1.643516 2.424936
H  1.953405 -0.734485 0.071307
H  2.90771 2.176165 -0.372116
H  4.44861 1.209993 -2.858045
H  4.946887 1.322921 -1.176437
H  5.070568 -0.213741 -2.027821
H  1.373902 -0.888301 -2.248474
H  2.152512 0.131064 -3.459627
H  2.94724 -1.329348 -2.884237
H  4.462681 0.829085 1.014343
H  -1.532738 1.885237 -1.374139
H  5.669227 -1.747643 2.902175
H  5.590522 0.016341 2.864755
H  4.557831 -0.907136 3.96042
H  2.005073 -1.927301 2.214685
H  3.009931 -2.730509 1.01995
H  3.376036 -2.892572 2.728977
H  -1.270419 -1.024201 -2.016338
H  -2.208508 0.186881 -2.88675
H  -1.44796 2.52255 1.261156
H  -0.630135 1.090829 1.856087
H  -2.285167 1.417714 2.353884
H  -3.88553 0.06642 2.238356
H  -5.229493 -1.931705 0.36851
H  -6.972982 -1.438298 2.168794
H  -5.888377 -2.699088 2.704644
H  -5.673266 -1.0490 3.30183
elementType: O C H
totalener: -965.43332373 hartree
nucrepener: 1795.85501671 hartree
electener: -2761.28834043 hartree
oneelecener: -4877.68443097 hartree
twoeener: 2116.39609054 hartree
cpcmener: -0.02794802 hartree
kineticenergy: 960.98607101 hartree
xcener: -95.142241007804 hartree
chargesum: -0.0000000
charge: -0.284849 -0.465264 -0.445636 0.097871 0.077700 -0.130940 -0.274120 -0.272071 -0.321353 0.411102 -0.004864 0.223625 -0.224141 -0.284566 -0.138279 -0.016742 -0.040770 0.280689 -0.245459 -0.241279 -0.080626 -0.216219 0.095376 0.088602 0.097670 0.088079 0.096964 0.084973 0.100866 0.096154 0.116113 0.109184 0.096099 0.084230 0.097685 0.101581 0.103506 0.094985 0.104118 0.097920 0.112372 0.109893 0.104742 0.117885 0.125713 0.094538 0.094264 0.082679
qa: -0.2848 -0.4653 -0.4456 0.0979 0.0777 -0.1309 -0.2741 -0.2721 -0.3214 0.4111 -0.0049 0.2236 -0.2241 -0.2846 -0.1383 -0.0167 -0.0408 0.2807 -0.2455 -0.2413 -0.0806 -0.2162 0.0954 0.0886 0.0977 0.0881 0.0970 0.0850 0.1009 0.0962 0.1161 0.1092 0.0961 0.0842 0.0977 0.1016 0.1035 0.0950 0.1041 0.0979 0.1124 0.1099 0.1047 0.1179 0.1257 0.0945 0.0943 0.0827
va: 2.1061 2.0399 2.0498 3.7054 3.7081 3.8872 3.9169 3.9128 3.8936 4.1762 3.6940 3.7629 3.9225 3.9425 3.9654 3.7228 3.5419 4.0528 3.9389 3.9120 3.8233 3.9588 1.0238 1.0335 1.0015 1.0065 1.0015 1.0122 0.9997 1.0011 1.0111 1.0339 0.9931 1.0105 0.9925 0.9962 0.9959 1.0051 1.0225 1.0249 1.0070 0.9980 1.0101 1.0187 1.0331 0.9961 0.9959 1.0085
dispcorr: -0.021969800 hartree
energy: -965.455293526320
dipole: 16.19591 -14.75752 1.43839 -8.27044 7.89877 -0.37168 11.18676 -10.03516 1.15159
magnitude: 1.87970 au
magnitude: 4.77781 debye
