program: Orca
programVersion: 5.0.2
elementType: O O O C C C C C C C C C C C C C C C C C C C H H H H H H H H H H H H H H H H H H H H H H H H H H
charge: 0
multiplicity: 1
keywords: wb97x-d3
keywords: def2-TZVPP
keywords: def2/J RIJCOSX
keywords: DEFGRID2
keywords: scfconv7
keywords: smallprint printgap noloewdin
keywords: NOSOSCF
formula: C19H26O3
InChI: InChI=1/C19H26O3/c1-7-8-13-12(4)16(10-15(13)20)22-18(21)17-14(9-11(2)3)19(17,5)6/h7-9,14,16-17H,10H2,1-6H3
48 atoms
O  -0.14524 -0.374107 0.045315
O  0.90827 0.443232 -1.758574
O  -4.042242 -2.823544 0.216964
C  2.695673 1.789292 0.455751
C  3.407949 0.625412 -0.141803
C  1.988441 0.442979 0.376862
C  3.045743 2.242271 1.852515
C  2.276526 2.928607 -0.441274
C  4.53473 -0.067237 0.526571
C  0.897443 0.188737 -0.57529
C  5.08598 -1.208219 0.102439
C  -1.329915 -0.688939 -0.690927
C  6.254396 -1.819168 0.812957
C  4.609297 -1.962827 -1.100944
C  -1.804663 -2.096472 -0.365005
C  -2.456551 0.21907 -0.263091
C  -3.557571 -0.484857 0.07377
C  -3.254275 -1.922595 0.006162
C  -2.285833 1.690485 -0.293628
C  -4.879087 -0.025129 0.479643
C  -5.492685 1.077295 0.042864
C  -6.843468 1.515784 0.489286
H  3.462827 0.648767 -1.226219
H  1.886003 -0.068556 1.326746
H  2.219739 2.811998 2.281734
H  3.255877 1.413362 2.52764
H  3.921726 2.893512 1.836469
H  2.149473 2.635865 -1.480754
H  1.341641 3.375346 -0.097186
H  3.040039 3.708227 -0.416111
H  4.947039 0.400102 1.415639
H  -1.146945 -0.567407 -1.760628
H  6.008782 -2.818488 1.181293
H  7.10459 -1.941224 0.136759
H  6.582044 -1.217337 1.66039
H  4.487245 -3.022006 -0.864359
H  3.660523 -1.599494 -1.4924
H  5.345859 -1.912181 -1.906964
H  -1.263112 -2.511783 0.488225
H  -1.691714 -2.794899 -1.194379
H  -3.013993 2.196423 0.338021
H  -2.41416 2.065876 -1.312069
H  -1.287776 1.988232 0.029533
H  -5.405165 -0.665683 1.182123
H  -5.008038 1.704119 -0.698894
H  -6.799803 2.509857 0.939812
H  -7.52853 1.593337 -0.357706
H  -7.275828 0.830315 1.217681
elementType: O C H
totalener: -965.42401474 hartree
nucrepener: 1771.11477764 hartree
electener: -2736.53879238 hartree
oneelecener: -4828.48914939 hartree
twoeener: 2091.95035701 hartree
cpcmener: -0.03472941 hartree
kineticenergy: 961.00197020 hartree
xcener: -95.146311400028 hartree
chargesum: -0.0000000
charge: -0.300364 -0.501589 -0.482722 0.150729 -0.055868 -0.059264 -0.294997 -0.273946 -0.271514 0.388460 -0.016102 0.287608 -0.230072 -0.255831 -0.147977 -0.058817 -0.004459 0.306922 -0.275644 -0.246721 -0.088976 -0.215823 0.101649 0.092236 0.099675 0.089642 0.103183 0.093532 0.096344 0.099785 0.126584 0.103835 0.095649 0.094519 0.089057 0.095062 0.082079 0.102414 0.103493 0.102777 0.113340 0.125133 0.106421 0.117456 0.133567 0.095692 0.097147 0.086696
qa: -0.3004 -0.5016 -0.4827 0.1507 -0.0559 -0.0593 -0.2950 -0.2739 -0.2715 0.3885 -0.0161 0.2876 -0.2301 -0.2558 -0.1480 -0.0588 -0.0045 0.3069 -0.2756 -0.2467 -0.0890 -0.2158 0.1016 0.0922 0.0997 0.0896 0.1032 0.0935 0.0963 0.0998 0.1266 0.1038 0.0956 0.0945 0.0891 0.0951 0.0821 0.1024 0.1035 0.1028 0.1133 0.1251 0.1064 0.1175 0.1336 0.0957 0.0971 0.0867
va: 2.1196 1.9938 2.0115 3.7329 3.8397 3.8112 3.9166 3.8824 3.8850 4.1505 3.7073 3.7036 3.9289 3.9451 3.9446 3.7964 3.4545 4.0475 3.9435 3.8709 3.8599 3.9510 1.0217 1.0342 1.0016 1.0018 0.9981 1.0169 1.0011 1.0015 1.0035 1.0342 0.9961 0.9949 1.0073 0.9987 1.0135 0.9968 1.0272 1.0232 0.9993 0.9914 1.0077 1.0240 0.9991 0.9968 0.9959 1.0083
dispcorr: -0.021632868 hartree
energy: -965.445647603863
dipole: 15.58699 -14.38465 1.20234 11.13391 -9.34626 1.78764 3.82158 -3.32787 0.49371
magnitude: 2.21022 au
magnitude: 5.61792 debye
