program: Orca
programVersion: 5.0.2
elementType: O O O C C C C C C C C C C C C C C C C C C C H H H H H H H H H H H H H H H H H H H H H H H H H H
charge: 0
multiplicity: 1
keywords: wb97x-d3
keywords: def2-TZVPP
keywords: def2/J RIJCOSX
keywords: DEFGRID2
keywords: scfconv7
keywords: smallprint printgap noloewdin
keywords: NOSOSCF
formula: C19H26O3
InChI: InChI=1/C19H26O3/c1-7-8-13-12(4)16(10-15(13)20)22-18(21)17-14(9-11(2)3)19(17,5)6/h7-9,14,16-17H,10H2,1-6H3
48 atoms
O  -0.399444 0.234012 -0.19214
O  1.002685 -0.15732 -1.887448
O  -3.908017 -2.71284 -0.603347
C  2.842606 1.620001 0.030703
C  3.314802 0.201685 -0.077673
C  1.862409 0.479546 0.256292
C  3.189805 2.438721 1.250381
C  2.768386 2.447937 -1.228509
C  4.191516 -0.432561 0.924415
C  0.818625 0.151975 -0.73186
C  5.170361 -1.310976 0.679518
C  -1.522527 -0.08878 -1.021683
C  5.99534 -1.869259 1.800427
C  5.551075 -1.82015 -0.677139
C  -1.816766 -1.580622 -1.082477
C  -2.735967 0.537579 -0.394076
C  -3.709549 -0.36831 -0.170653
C  -3.246141 -1.693901 -0.611361
C  -2.764422 2.0004 -0.159954
C  -5.054405 -0.183936 0.355928
C  -5.417972 0.723455 1.265819
C  -6.808412 0.892027 1.77103
H  3.466005 -0.125708 -1.100247
H  1.559737 0.343485 1.288886
H  4.192012 2.860512 1.153371
H  2.491078 3.270023 1.359684
H  3.158351 1.862829 2.173992
H  2.611633 1.852715 -2.125742
H  1.964902 3.18459 -1.165143
H  3.703764 2.994399 -1.362102
H  4.015254 -0.155119 1.95948
H  -1.374873 0.337399 -2.01747
H  5.925106 -2.959574 1.834151
H  7.053645 -1.634117 1.659886
H  5.690525 -1.48065 2.771783
H  4.941947 -1.424525 -1.487023
H  6.593354 -1.576286 -0.898031
H  5.478199 -2.910033 -0.710034
H  -1.168275 -2.153642 -0.415558
H  -1.705357 -1.998544 -2.083211
H  -2.370853 2.24711 0.828853
H  -3.7789 2.395629 -0.210063
H  -2.146463 2.523594 -0.890283
H  -5.807656 -0.868811 -0.024463
H  -4.671082 1.383271 1.69594
H  -7.499108 0.185618 1.311353
H  -6.849472 0.757488 2.85396
H  -7.172915 1.902763 1.574336
elementType: O C H
totalener: -965.42624646 hartree
nucrepener: 1755.72337614 hartree
electener: -2721.14962260 hartree
oneelecener: -4797.81453406 hartree
twoeener: 2076.66491146 hartree
cpcmener: -0.03619286 hartree
kineticenergy: 961.00042522 hartree
xcener: -95.145099414341 hartree
chargesum: 0.0000000
charge: -0.294152 -0.498592 -0.480821 0.096534 0.026331 -0.079197 -0.277402 -0.269569 -0.281229 0.412683 -0.050413 0.239709 -0.218280 -0.253177 -0.136040 -0.040897 0.003738 0.308982 -0.303225 -0.244682 -0.086773 -0.215504 0.093404 0.093626 0.098971 0.097872 0.090895 0.089856 0.099990 0.098904 0.122001 0.106592 0.093393 0.093466 0.088819 0.090707 0.096668 0.095851 0.107606 0.104601 0.122361 0.114627 0.112495 0.114760 0.134265 0.087411 0.096655 0.096179
qa: -0.2942 -0.4986 -0.4808 0.0965 0.0263 -0.0792 -0.2774 -0.2696 -0.2812 0.4127 -0.0504 0.2397 -0.2183 -0.2532 -0.1360 -0.0409 0.0037 0.3090 -0.3032 -0.2447 -0.0868 -0.2155 0.0934 0.0936 0.0990 0.0979 0.0909 0.0899 0.1000 0.0989 0.1220 0.1066 0.0934 0.0935 0.0888 0.0907 0.0967 0.0959 0.1076 0.1046 0.1224 0.1146 0.1125 0.1148 0.1343 0.0874 0.0967 0.0962
va: 2.1233 2.0042 2.0142 3.7089 3.7842 3.8223 3.9110 3.9031 3.8792 4.1453 3.7632 3.7692 3.9196 3.9393 3.9230 3.7352 3.4863 4.0482 3.9614 3.8766 3.8549 3.9510 1.0311 1.0329 1.0009 1.0015 1.0064 1.0176 0.9999 0.9999 1.0102 1.0194 0.9965 0.9958 1.0086 1.0108 0.9968 0.9969 1.0226 1.0240 0.9917 0.9990 1.0034 1.0263 0.9986 1.0081 0.9962 0.9970
dispcorr: -0.020821271 hartree
energy: -965.447067730965
dipole: 17.35075 -16.46497 0.88578 10.55235 -8.05718 2.49517 8.14738 -7.03383 1.11355
magnitude: 2.87236 au
magnitude: 7.30096 debye
