program: Orca
programVersion: 5.0.2
elementType: O O O C C C C C C C C C C C C C C C C C C C H H H H H H H H H H H H H H H H H H H H H H H H H H
charge: 0
multiplicity: 1
keywords: wb97x-d3
keywords: def2-TZVPP
keywords: def2/J RIJCOSX
keywords: DEFGRID2
keywords: scfconv7
keywords: smallprint printgap noloewdin
keywords: NOSOSCF
formula: C19H26O3
InChI: InChI=1/C19H26O3/c1-7-8-13-12(4)16(10-15(13)20)22-18(21)17-14(9-11(2)3)19(17,5)6/h7-9,14,16-17H,10H2,1-6H3
48 atoms
O  0.120256 -0.920548 0.06038
O  0.756405 -2.866111 0.945126
O  -4.279586 -0.701951 1.52311
C  2.574476 0.090119 1.708503
C  2.735304 0.227774 0.223046
C  2.339758 -1.112764 0.809233
C  3.791259 0.017895 2.59871
C  1.408443 0.787186 2.367507
C  4.048004 0.354969 -0.439064
C  1.013579 -1.727382 0.619608
C  4.349497 1.171266 -1.45512
C  -1.208196 -1.408765 -0.138303
C  5.725287 1.177548 -2.05133
C  3.395093 2.131563 -2.097192
C  -2.03568 -1.502024 1.132941
C  -1.919878 -0.401754 -0.997064
C  -3.111482 -0.036745 -0.474602
C  -3.292269 -0.726865 0.816476
C  -1.293055 0.041109 -2.265227
C  -4.071481 0.85977 -1.100137
C  -5.163546 1.392832 -0.54309
C  -6.09136 2.304072 -1.268541
H  1.925823 0.770047 -0.250742
H  3.123551 -1.860995 0.86276
H  4.172524 1.019845 2.8059
H  3.5345 -0.441278 3.555148
H  4.602861 -0.564643 2.164915
H  1.050161 0.219969 3.229113
H  1.726444 1.76616 2.730682
H  0.567691 0.950891 1.69677
H  4.83403 -0.296086 -0.067084
H  -1.163668 -2.367951 -0.663484
H  6.182196 2.167653 -1.975855
H  6.388844 0.461727 -1.566317
H  5.689941 0.935953 -3.116946
H  3.781415 3.152331 -2.035343
H  3.286362 1.9112 -3.162713
H  2.399617 2.131036 -1.657654
H  -1.532084 -1.021403 1.976406
H  -2.270141 -2.523979 1.428765
H  -0.455605 0.713645 -2.062808
H  -1.98431 0.567014 -2.919421
H  -0.884619 -0.811883 -2.81003
H  -3.858318 1.123247 -2.132078
H  -5.419186 1.178012 0.486726
H  -7.102771 1.891674 -1.29152
H  -6.167315 3.268949 -0.762096
H  -5.773196 2.481718 -2.295669
elementType: O C H
totalener: -965.42456640 hartree
nucrepener: 1798.58899654 hartree
electener: -2764.01356294 hartree
oneelecener: -4883.11123178 hartree
twoeener: 2119.09766884 hartree
cpcmener: -0.03679300 hartree
kineticenergy: 961.00343287 hartree
xcener: -95.147938514618 hartree
chargesum: 0.0000000
charge: -0.283588 -0.496662 -0.478946 0.098217 0.079891 -0.107818 -0.278650 -0.278544 -0.299274 0.421530 -0.052441 0.222897 -0.220899 -0.254130 -0.133438 -0.041065 -0.024516 0.304754 -0.257858 -0.242202 -0.082951 -0.216105 0.092412 0.093086 0.097524 0.098197 0.089971 0.102302 0.098899 0.087900 0.121849 0.115752 0.093993 0.089521 0.093187 0.097731 0.096515 0.088140 0.110398 0.105127 0.107838 0.104095 0.114306 0.124854 0.123457 0.094956 0.095340 0.084449
qa: -0.2836 -0.4967 -0.4789 0.0982 0.0799 -0.1078 -0.2786 -0.2785 -0.2993 0.4215 -0.0524 0.2229 -0.2209 -0.2541 -0.1334 -0.0411 -0.0245 0.3048 -0.2579 -0.2422 -0.0830 -0.2161 0.0924 0.0931 0.0975 0.0982 0.0900 0.1023 0.0989 0.0879 0.1218 0.1158 0.0940 0.0895 0.0932 0.0977 0.0965 0.0881 0.1104 0.1051 0.1078 0.1041 0.1143 0.1249 0.1235 0.0950 0.0953 0.0844
va: 2.1200 2.0018 2.0105 3.6956 3.7271 3.8580 3.9104 3.9033 3.8596 4.1438 3.7652 3.7708 3.9212 3.9436 3.9511 3.7672 3.5591 4.0313 3.9604 3.8880 3.8277 3.9592 1.0167 1.0317 1.0013 1.0010 1.0064 0.9989 1.0017 1.0146 1.0105 1.0141 0.9959 1.0087 0.9961 0.9972 0.9965 1.0098 1.0169 1.0255 0.9971 1.0099 0.9990 1.0153 1.0305 0.9964 0.9957 1.0083
dispcorr: -0.022247116 hartree
energy: -965.446813519896
dipole: 15.51782 -13.91734 1.60047 16.61645 -14.94156 1.67489 -7.46352 5.67466 -1.78886
magnitude: 2.92691 au
magnitude: 7.43961 debye
