program: Orca
programVersion: 5.0.2
elementType: O O O C C C C C C C C C C C C C C C C C C C H H H H H H H H H H H H H H H H H H H H H H H H H H
charge: 0
multiplicity: 1
keywords: wb97x-d3
keywords: def2-TZVPP
keywords: def2/J RIJCOSX
keywords: DEFGRID2
keywords: scfconv7
keywords: smallprint printgap noloewdin
keywords: NOSOSCF
formula: C19H26O3
InChI: InChI=1/C19H26O3/c1-7-8-13-12(4)16(10-15(13)20)22-18(21)17-14(9-11(2)3)19(17,5)6/h7-9,14,16-17H,10H2,1-6H3
48 atoms
O  0.029332 -0.031547 -1.005091
O  0.676072 -1.226029 -2.776011
O  -4.008285 -1.930859 0.143162
C  2.78795 -1.381818 -0.066703
C  2.697073 0.112923 0.076773
C  2.325109 -0.525665 -1.232572
C  4.143796 -2.025764 -0.205472
C  1.793474 -2.231693 0.683435
C  3.90872 0.966589 0.153707
C  0.946546 -0.633817 -1.753539
C  4.421229 1.461999 1.283496
C  -1.340523 -0.139544 -1.407435
C  5.638556 2.335026 1.270408
C  3.844334 1.200414 2.641012
C  -1.971629 -1.47984 -1.067444
C  -2.122321 0.875862 -0.621808
C  -3.18411 0.327673 0.009865
C  -3.183396 -1.126114 -0.239854
C  -1.706995 2.297484 -0.668408
C  -4.16723 1.058022 0.795532
C  -5.243381 0.564204 1.416858
C  -6.194632 1.403607 2.196938
H  1.863227 0.443681 0.687871
H  3.050803 -0.443263 -2.036047
H  4.056348 -3.007692 -0.674521
H  4.830115 -1.431083 -0.807624
H  4.601083 -2.168634 0.775897
H  0.850839 -1.719093 0.872316
H  1.57475 -3.154259 0.141428
H  2.207045 -2.512516 1.654056
H  4.408302 1.196267 -0.7834
H  -1.42225 0.089914 -2.473985
H  5.423459 3.31268 1.709789
H  6.440524 1.898351 1.871118
H  6.019862 2.495584 0.262133
H  2.995452 0.518851 2.626658
H  4.60292 0.770205 3.299764
H  3.521834 2.131625 3.114057
H  -1.302856 -2.10858 -0.473771
H  -2.263718 -2.054092 -1.946834
H  -1.61288 2.624849 -1.706952
H  -0.723782 2.430149 -0.210485
H  -2.402026 2.9635 -0.163068
H  -3.995158 2.127243 0.875519
H  -5.469591 -0.493154 1.373685
H  -6.256336 1.062867 3.232904
H  -5.908837 2.455266 2.20058
H  -7.205631 1.326094 1.789943
elementType: O C H
totalener: -965.42309931 hartree
nucrepener: 1792.86952661 hartree
electener: -2758.29262592 hartree
oneelecener: -4871.83525669 hartree
twoeener: 2113.54263077 hartree
cpcmener: -0.03544350 hartree
kineticenergy: 960.99710929 hartree
xcener: -95.144930275015 hartree
chargesum: 0.0000000
charge: -0.283244 -0.494819 -0.479212 0.152714 0.017593 -0.147408 -0.275060 -0.302422 -0.290615 0.424522 -0.027647 0.235754 -0.232228 -0.253863 -0.137675 -0.053079 -0.020422 0.304531 -0.252652 -0.242336 -0.083327 -0.217550 0.103906 0.101084 0.099051 0.092159 0.095855 0.087735 0.106422 0.100585 0.124021 0.113195 0.095107 0.094519 0.090134 0.087691 0.096477 0.100631 0.111153 0.108371 0.113782 0.109531 0.100704 0.124551 0.127319 0.094945 0.084406 0.095109
qa: -0.2832 -0.4948 -0.4792 0.1527 0.0176 -0.1474 -0.2751 -0.3024 -0.2906 0.4245 -0.0276 0.2358 -0.2322 -0.2539 -0.1377 -0.0531 -0.0204 0.3045 -0.2527 -0.2423 -0.0833 -0.2176 0.1039 0.1011 0.0991 0.0922 0.0959 0.0877 0.1064 0.1006 0.1240 0.1132 0.0951 0.0945 0.0901 0.0877 0.0965 0.1006 0.1112 0.1084 0.1138 0.1095 0.1007 0.1246 0.1273 0.0949 0.0844 0.0951
va: 2.1271 2.0016 2.0123 3.6745 3.7528 3.9324 3.8995 3.9031 3.8558 4.1489 3.6996 3.7503 3.9273 3.9409 3.9635 3.7693 3.5639 4.0273 3.9595 3.8989 3.8157 3.9594 1.0110 1.0303 1.0028 1.0020 1.0021 1.0127 0.9992 1.0028 1.0069 1.0163 0.9950 0.9964 1.0075 1.0081 0.9978 0.9977 1.0180 1.0240 0.9974 1.0010 1.0100 1.0156 1.0339 0.9961 1.0081 0.9959
dispcorr: -0.022429677 hartree
energy: -965.445528990158
dipole: 16.24969 -14.87740 1.37229 8.60584 -6.53109 2.07475 14.51236 -13.57762 0.93474
magnitude: 2.65735 au
magnitude: 6.75444 debye
