program: Orca
programVersion: 5.0.2
elementType: O O O C C C C C C C C C C C C C C C C C C C H H H H H H H H H H H H H H H H H H H H H H H H H H
charge: 0
multiplicity: 1
keywords: wb97x-d3
keywords: def2-TZVPP
keywords: def2/J RIJCOSX
keywords: DEFGRID2
keywords: scfconv7
keywords: smallprint printgap noloewdin
keywords: NOSOSCF
formula: C19H26O3
InChI: InChI=1/C19H26O3/c1-7-8-13-12(4)16(10-15(13)20)22-18(21)17-14(9-11(2)3)19(17,5)6/h7-9,14,16-17H,10H2,1-6H3
48 atoms
O  0.128675 -0.939524 0.142372
O  0.759924 -2.808062 1.183065
O  -4.262826 -0.547688 1.543488
C  2.56782 0.215443 1.711039
C  2.736803 0.219597 0.219922
C  2.341261 -1.064335 0.923128
C  3.782432 0.223911 2.607276
C  1.401041 0.971018 2.299521
C  4.04999 0.318052 -0.44351
C  1.017618 -1.696976 0.772586
C  4.307025 1.052295 -1.531149
C  -1.19694 -1.443485 -0.039261
C  5.686212 1.115437 -2.113302
C  3.272253 1.889775 -2.232865
C  -2.042869 -1.438175 1.223012
C  -1.888972 -0.497753 -0.980921
C  -3.073898 -0.066547 -0.494812
C  -3.27602 -0.653338 0.843758
C  -1.24876 -0.178164 -2.279163
C  -4.002452 0.815201 -1.185602
C  -5.137154 1.334074 -0.704755
C  -6.024514 2.236327 -1.489156
H  1.927777 0.716485 -0.30287
H  3.125271 -1.803225 1.050039
H  4.159876 1.241084 2.729717
H  3.524601 -0.153654 3.598358
H  4.596931 -0.390022 2.225535
H  0.567559 1.084676 1.609562
H  1.031106 0.480937 3.202452
H  1.72365 1.974974 2.581845
H  4.864176 -0.250515 -0.004013
H  -1.144665 -2.439227 -0.490068
H  6.049435 2.146217 -2.144504
H  6.402762 0.522539 -1.545148
H  5.6924 0.757826 -3.146171
H  3.577821 2.110205 -3.255931
H  2.29516 1.407904 -2.282855
H  3.131158 2.850225 -1.73101
H  -1.538994 -0.923953 2.045937
H  -2.308918 -2.435081 1.573083
H  -0.354067 0.430499 -2.127062
H  -1.903844 0.364158 -2.956187
H  -0.921485 -1.092848 -2.777033
H  -3.724622 1.078491 -2.201952
H  -5.461137 1.112436 0.303845
H  -5.634371 2.432482 -2.487733
H  -7.023741 1.806573 -1.591515
H  -6.155922 3.193283 -0.978897
elementType: O C H
totalener: -965.42346455 hartree
nucrepener: 1801.78385082 hartree
electener: -2767.20731537 hartree
oneelecener: -4889.50196239 hartree
twoeener: 2122.29464701 hartree
cpcmener: -0.03642248 hartree
kineticenergy: 961.00183581 hartree
xcener: -95.147429169672 hartree
chargesum: -0.0000000
charge: -0.282815 -0.497222 -0.478879 0.100224 0.076495 -0.111077 -0.284166 -0.277385 -0.313795 0.423986 -0.022611 0.217895 -0.221026 -0.278048 -0.134074 -0.038660 -0.029375 0.307044 -0.252409 -0.240134 -0.084719 -0.217824 0.092244 0.093066 0.097812 0.098275 0.090317 0.087631 0.101959 0.098564 0.120592 0.117041 0.098487 0.086269 0.093412 0.095784 0.094227 0.109190 0.110122 0.105857 0.104784 0.103077 0.114589 0.123910 0.125863 0.084724 0.095436 0.095343
qa: -0.2828 -0.4972 -0.4789 0.1002 0.0765 -0.1111 -0.2842 -0.2774 -0.3138 0.4240 -0.0226 0.2179 -0.2210 -0.2780 -0.1341 -0.0387 -0.0294 0.3070 -0.2524 -0.2401 -0.0847 -0.2178 0.0922 0.0931 0.0978 0.0983 0.0903 0.0876 0.1020 0.0986 0.1206 0.1170 0.0985 0.0863 0.0934 0.0958 0.0942 0.1092 0.1101 0.1059 0.1048 0.1031 0.1146 0.1239 0.1259 0.0847 0.0954 0.0953
va: 2.1192 2.0019 2.0117 3.7038 3.7269 3.8667 3.9153 3.9033 3.8731 4.1459 3.7233 3.7811 3.9235 3.9439 3.9601 3.7570 3.5693 4.0284 3.9629 3.8940 3.8208 3.9597 1.0172 1.0309 1.0010 1.0011 1.0066 1.0146 0.9988 1.0016 1.0105 1.0137 0.9931 1.0095 0.9947 1.0023 0.9993 0.9933 1.0177 1.0246 0.9965 1.0106 0.9983 1.0162 1.0329 1.0082 0.9961 0.9956
dispcorr: -0.022400477 hartree
energy: -965.445865024688
dipole: 15.27192 -13.69752 1.57441 16.13399 -14.62010 1.51388 -8.65591 6.75905 -1.89685
magnitude: 2.89286 au
magnitude: 7.35307 debye
