program: Orca
programVersion: 5.0.2
elementType: O O O C C C C C C C C C C C C C C C C C C C H H H H H H H H H H H H H H H H H H H H H H H H H H
charge: 0
multiplicity: 1
keywords: wb97x-d3
keywords: def2-TZVPP
keywords: def2/J RIJCOSX
keywords: DEFGRID2
keywords: scfconv7
keywords: smallprint printgap noloewdin
keywords: NOSOSCF
formula: C19H26O3
InChI: InChI=1/C19H26O3/c1-7-8-13-12(4)16(10-15(13)20)22-18(21)17-14(9-11(2)3)19(17,5)6/h7-9,14,16-17H,10H2,1-6H3
48 atoms
O  -0.158552 0.557362 -0.196516
O  1.044206 0.435048 -2.073709
O  -3.318073 -2.718341 -0.832421
C  3.230213 1.844096 -0.275575
C  3.515705 0.389932 -0.410214
C  2.130332 0.833326 0.023844
C  3.754308 2.582779 0.931829
C  3.166929 2.702892 -1.51434
C  4.389138 -0.344092 0.54154
C  0.990654 0.601061 -0.875013
C  4.170353 -1.588951 0.973065
C  -1.349764 0.264424 -0.93312
C  5.109458 -2.260691 1.927216
C  2.981584 -2.406159 0.566657
C  -1.478456 -1.208958 -1.299545
C  -2.524085 0.557237 -0.035276
C  -3.366502 -0.493094 0.040523
C  -2.801515 -1.625401 -0.708373
C  -2.669683 1.891107 0.594768
C  -4.639617 -0.62761 0.735258
C  -5.544547 0.338899 0.905042
C  -6.837127 0.153549 1.62037
H  3.552498 0.03517 -1.437828
H  1.898989 0.715563 1.076298
H  3.757985 1.966231 1.830402
H  4.776329 2.924434 0.757308
H  3.1437 3.463562 1.136988
H  2.892921 2.14822 -2.408558
H  2.454282 3.520072 -1.389232
H  4.14634 3.148881 -1.697006
H  5.278974 0.175668 0.886546
H  -1.398951 0.908659 -1.81592
H  5.532131 -3.167732 1.487878
H  5.933636 -1.611089 2.220857
H  4.584983 -2.573298 2.833815
H  3.291207 -3.405356 0.251864
H  2.304042 -2.547164 1.413347
H  2.409912 -1.963132 -0.24716
H  -0.677932 -1.809418 -0.860302
H  -1.466795 -1.387019 -2.3748
H  -3.297983 1.853601 1.483557
H  -3.134345 2.59039 -0.10533
H  -1.703238 2.313205 0.867943
H  -4.865445 -1.620942 1.114396
H  -5.365175 1.325845 0.490093
H  -7.681357 0.3836 0.967026
H  -6.957225 -0.864642 1.988913
H  -6.912867 0.835497 2.470282
elementType: O C H
totalener: -965.42436477 hartree
nucrepener: 1785.28783843 hartree
electener: -2750.71220320 hartree
oneelecener: -4856.96399186 hartree
twoeener: 2106.25178866 hartree
cpcmener: -0.03499328 hartree
kineticenergy: 961.00424993 hartree
xcener: -95.145555278849 hartree
chargesum: -0.0000000
charge: -0.299558 -0.503327 -0.481766 0.147757 -0.015653 -0.081077 -0.285387 -0.279157 -0.306645 0.387550 -0.011091 0.295747 -0.229131 -0.241418 -0.150940 -0.086511 0.008752 0.303752 -0.286698 -0.241965 -0.086474 -0.216309 0.102919 0.093936 0.093268 0.099766 0.098101 0.090976 0.100841 0.096679 0.125166 0.106098 0.096792 0.090163 0.094922 0.101877 0.103284 0.080137 0.107535 0.106908 0.111930 0.122709 0.106229 0.116106 0.133723 0.096944 0.086783 0.095757
qa: -0.2996 -0.5033 -0.4818 0.1478 -0.0157 -0.0811 -0.2854 -0.2792 -0.3066 0.3875 -0.0111 0.2957 -0.2291 -0.2414 -0.1509 -0.0865 0.0088 0.3038 -0.2867 -0.2420 -0.0865 -0.2163 0.1029 0.0939 0.0933 0.0998 0.0981 0.0910 0.1008 0.0967 0.1252 0.1061 0.0968 0.0902 0.0949 0.1019 0.1033 0.0801 0.1075 0.1069 0.1119 0.1227 0.1062 0.1161 0.1337 0.0969 0.0868 0.0958
va: 2.1209 1.9962 2.0147 3.6966 3.8184 3.8186 3.9097 3.8929 3.8943 4.1194 3.7049 3.7030 3.9315 3.9363 3.9142 3.8272 3.4546 4.0556 3.9489 3.8656 3.8574 3.9516 1.0267 1.0305 1.0017 0.9998 1.0029 1.0180 0.9989 1.0010 1.0030 1.0173 0.9962 1.0060 0.9961 1.0005 0.9974 1.0120 1.0236 1.0229 0.9978 0.9899 1.0147 1.0253 0.9991 0.9961 1.0082 0.9970
dispcorr: -0.022093334 hartree
energy: -965.446458099770
dipole: 11.65304 -11.16283 0.49021 6.95313 -4.71266 2.24047 10.61303 -9.11965 1.49338
magnitude: 2.73682 au
magnitude: 6.95645 debye
