program: Orca
programVersion: 5.0.2
elementType: O O O C C C C C C C C C C C C C C C C C C C H H H H H H H H H H H H H H H H H H H H H H H H H H
charge: 0
multiplicity: 1
keywords: wb97x-d3
keywords: def2-TZVPP
keywords: def2/J RIJCOSX
keywords: DEFGRID2
keywords: scfconv7
keywords: smallprint printgap noloewdin
keywords: NOSOSCF
formula: C19H26O3
InChI: InChI=1/C19H26O3/c1-7-8-13-12(4)16(10-15(13)20)22-18(21)17-14(9-11(2)3)19(17,5)6/h7-9,14,16-17H,10H2,1-6H3
48 atoms
O  -0.207018 0.57725 -0.359315
O  1.086991 0.341748 -2.163577
O  -3.452149 -2.609659 -1.15604
C  3.212492 1.794088 -0.345442
C  3.467518 0.327919 -0.351553
C  2.071373 0.833959 -0.034377
C  3.686018 2.61159 0.832201
C  3.245946 2.554875 -1.647722
C  4.271538 -0.340955 0.704295
C  0.976754 0.566182 -0.97824
C  4.0078 -1.541221 1.2273
C  -1.36851 0.287436 -1.144837
C  4.887653 -2.142359 2.2803
C  2.828653 -2.37504 0.829395
C  -1.519144 -1.185867 -1.49809
C  -2.563696 0.620221 -0.293921
C  -3.412193 -0.422476 -0.18987
C  -2.881454 -1.554066 -0.965858
C  -2.708156 1.98476 0.265961
C  -4.690069 -0.531074 0.499204
C  -5.021156 0.096369 1.630453
C  -6.336252 -0.045424 2.313091
H  3.5536 -0.107462 -1.344716
H  1.777325 0.801138 1.008336
H  3.615355 2.067983 1.774273
H  4.727185 2.911333 0.697233
H  3.091154 3.521144 0.929996
H  3.013913 1.937057 -2.511856
H  2.547081 3.393201 -1.631691
H  4.24564 2.965196 -1.801898
H  5.153229 0.191369 1.050847
H  -1.369124 0.919724 -2.037393
H  5.311043 -3.091442 1.942267
H  5.711193 -1.483389 2.554312
H  4.316664 -2.364889 3.185328
H  2.279724 -1.9702 -0.018835
H  3.145549 -3.387622 0.569382
H  2.13019 -2.476857 1.664117
H  -0.76566 -1.805106 -1.004559
H  -1.452711 -1.381633 -2.568118
H  -3.754563 2.248452 0.417598
H  -2.251303 2.725271 -0.391216
H  -2.210839 2.065867 1.235318
H  -5.408327 -1.214641 0.054484
H  -4.298224 0.741755 2.119218
H  -6.837633 0.921415 2.395461
H  -6.999873 -0.729676 1.785186
H  -6.207316 -0.411151 3.333909
elementType: O C H
totalener: -965.42476864 hartree
nucrepener: 1788.12636728 hartree
electener: -2753.55113592 hartree
oneelecener: -4862.61239777 hartree
twoeener: 2109.06126185 hartree
cpcmener: -0.03488910 hartree
kineticenergy: 961.00773382 hartree
xcener: -95.145635426606 hartree
chargesum: 0.0000000
charge: -0.296322 -0.503313 -0.481363 0.146661 -0.013666 -0.088759 -0.285671 -0.282076 -0.302404 0.394696 -0.015445 0.257112 -0.229432 -0.237321 -0.142101 -0.051936 0.007704 0.304559 -0.304283 -0.242238 -0.086313 -0.215608 0.104081 0.094853 0.093303 0.099782 0.098294 0.091547 0.100961 0.096661 0.124937 0.106977 0.097139 0.090291 0.094693 0.079110 0.102006 0.101872 0.108250 0.104685 0.113966 0.113855 0.121878 0.114295 0.133777 0.096161 0.087348 0.096798
qa: -0.2963 -0.5033 -0.4814 0.1467 -0.0137 -0.0888 -0.2857 -0.2821 -0.3024 0.3947 -0.0154 0.2571 -0.2294 -0.2373 -0.1421 -0.0519 0.0077 0.3046 -0.3043 -0.2422 -0.0863 -0.2156 0.1041 0.0949 0.0933 0.0998 0.0983 0.0915 0.1010 0.0967 0.1249 0.1070 0.0971 0.0903 0.0947 0.0791 0.1020 0.1019 0.1083 0.1047 0.1140 0.1139 0.1219 0.1143 0.1338 0.0962 0.0873 0.0968
va: 2.1179 1.9977 2.0144 3.6941 3.8140 3.8294 3.9097 3.8922 3.8916 4.1127 3.7092 3.7614 3.9305 3.9356 3.9147 3.7599 3.4780 4.0459 3.9609 3.8744 3.8542 3.9520 1.0255 1.0298 1.0020 0.9997 1.0029 1.0182 0.9989 1.0009 1.0028 1.0153 0.9962 1.0060 0.9964 1.0120 1.0000 0.9980 1.0217 1.0250 0.9992 1.0035 0.9920 1.0276 0.9991 0.9969 1.0081 0.9961
dispcorr: -0.022056103 hartree
energy: -965.446824741192
dipole: 12.38726 -11.74904 0.63822 6.65289 -4.48582 2.16707 13.14778 -11.34185 1.80593
magnitude: 2.89221 au
magnitude: 7.35141 debye
