program: Orca
programVersion: 5.0.2
elementType: O O O C C C C C C C C C C C C C C C C C C C H H H H H H H H H H H H H H H H H H H H H H H H H H
charge: 0
multiplicity: 1
keywords: wb97x-d3
keywords: def2-TZVPP
keywords: def2/J RIJCOSX
keywords: DEFGRID2
keywords: scfconv7
keywords: smallprint printgap noloewdin
keywords: NOSOSCF
formula: C19H26O3
InChI: InChI=1/C19H26O3/c1-7-8-13-12(4)16(10-15(13)20)22-18(21)17-14(9-11(2)3)19(17,5)6/h7-9,14,16-17H,10H2,1-6H3
48 atoms
O  -0.021625 -0.241879 -0.01112
O  0.963777 0.64496 -1.819554
O  -4.057614 -2.535636 0.071038
C  2.894898 1.866139 0.339288
C  3.530503 0.684893 -0.306696
C  2.132055 0.549601 0.26598
C  3.340891 2.264435 1.725104
C  2.479375 3.042324 -0.510076
C  4.658045 -0.052933 0.320237
C  0.998373 0.345975 -0.646958
C  4.808991 -1.379895 0.30586
C  -1.210996 -0.566867 -0.735165
C  5.988157 -2.037932 0.954054
C  3.834864 -2.318317 -0.337464
C  -1.755557 -1.911877 -0.292529
C  -2.309609 0.415607 -0.429817
C  -3.463098 -0.20485 -0.092053
C  -3.22758 -1.661461 -0.078928
C  -2.05037 1.867501 -0.573402
C  -4.733584 0.451217 0.176727
C  -5.861162 -0.11961 0.61313
C  -7.120636 0.634859 0.86041
H  3.551114 0.725175 -1.39344
H  2.049077 0.018689 1.207238
H  3.583908 1.404916 2.349722
H  4.226799 2.900409 1.673234
H  2.557782 2.831175 2.231548
H  2.279837 2.776675 -1.545495
H  1.58679 3.523394 -0.105017
H  3.277992 3.786444 -0.515444
H  5.421812 0.549231 0.805057
H  -1.005417 -0.560263 -1.807992
H  5.665142 -2.75149 1.716432
H  6.568218 -2.608636 0.224532
H  6.654523 -1.316559 1.426433
H  3.386957 -2.98067 0.408019
H  3.028879 -1.81245 -0.865109
H  4.345899 -2.965856 -1.054225
H  -1.314279 -2.22324 0.657776
H  -1.587928 -2.711649 -1.013139
H  -1.285175 2.194659 0.135558
H  -2.935548 2.476667 -0.407183
H  -1.664785 2.087398 -1.571435
H  -4.751082 1.522912 0.001308
H  -5.898664 -1.18299 0.81105
H  -7.442397 0.526297 1.898793
H  -7.012808 1.697939 0.646101
H  -7.935535 0.243466 0.246999
elementType: O C H
totalener: -965.42415115 hartree
nucrepener: 1780.36395471 hartree
electener: -2745.78810586 hartree
oneelecener: -4847.05278410 hartree
twoeener: 2101.26467824 hartree
cpcmener: -0.03219065 hartree
kineticenergy: 961.00039188 hartree
xcener: -95.147219142434 hartree
chargesum: 0.0000000
charge: -0.299781 -0.500026 -0.480034 0.149370 -0.013286 -0.107753 -0.284268 -0.283452 -0.304992 0.402135 -0.013276 0.257935 -0.228656 -0.243316 -0.134248 -0.023334 -0.039693 0.301201 -0.240718 -0.244432 -0.085704 -0.217329 0.105473 0.096233 0.093720 0.099345 0.097777 0.092612 0.098024 0.097841 0.124504 0.105751 0.094214 0.097012 0.090473 0.100844 0.082720 0.102893 0.103804 0.098018 0.110511 0.104616 0.112295 0.124331 0.125859 0.095291 0.084382 0.095113
qa: -0.2998 -0.5000 -0.4800 0.1494 -0.0133 -0.1078 -0.2843 -0.2835 -0.3050 0.4021 -0.0133 0.2579 -0.2287 -0.2433 -0.1342 -0.0233 -0.0397 0.3012 -0.2407 -0.2444 -0.0857 -0.2173 0.1055 0.0962 0.0937 0.0993 0.0978 0.0926 0.0980 0.0978 0.1245 0.1058 0.0942 0.0970 0.0905 0.1008 0.0827 0.1029 0.1038 0.0980 0.1105 0.1046 0.1123 0.1243 0.1259 0.0953 0.0844 0.0951
va: 2.1161 1.9950 2.0073 3.6939 3.8117 3.8338 3.9059 3.8918 3.8901 4.1184 3.7063 3.7719 3.9300 3.9359 3.9709 3.7386 3.5542 4.0195 3.9377 3.9000 3.8212 3.9592 1.0245 1.0305 1.0022 0.9997 1.0028 1.0176 1.0002 1.0017 1.0034 1.0310 0.9966 0.9961 1.0059 0.9985 1.0125 0.9992 1.0249 1.0251 1.0007 1.0114 1.0048 1.0172 1.0321 0.9956 1.0082 0.9961
dispcorr: -0.022109005 hartree
energy: -965.446260152741
dipole: 14.28610 -12.99888 1.28723 7.89538 -6.59776 1.29761 6.01557 -5.24131 0.77426
magnitude: 1.98500 au
magnitude: 5.04547 debye
