program: Orca
programVersion: 5.0.2
elementType: O O O C C C C C C C C C C C C C C C C C C C H H H H H H H H H H H H H H H H H H H H H H H H H H
charge: 0
multiplicity: 1
keywords: wb97x-d3
keywords: def2-TZVPP
keywords: def2/J RIJCOSX
keywords: DEFGRID2
keywords: scfconv7
keywords: smallprint printgap noloewdin
keywords: NOSOSCF
formula: C19H26O3
InChI: InChI=1/C19H26O3/c1-7-8-13-12(4)16(10-15(13)20)22-18(21)17-14(9-11(2)3)19(17,5)6/h7-9,14,16-17H,10H2,1-6H3
48 atoms
O  -0.224481 -0.536629 0.137452
O  0.899132 0.079296 -1.702955
O  -4.504633 -2.313389 0.340479
C  2.682091 1.4661 0.512253
C  3.386273 0.285323 -0.083618
C  1.97047 0.123834 0.43578
C  3.045253 1.938314 1.898818
C  2.272986 2.596476 -0.400626
C  4.477473 -0.431252 0.605118
C  0.862422 -0.10118 -0.506821
C  5.60011 -0.900595 0.050035
C  -1.420995 -0.811891 -0.597425
C  6.609065 -1.640926 0.876238
C  5.967238 -0.764077 -1.396356
C  -2.135426 -2.017019 -0.014497
C  -2.403409 0.322156 -0.465132
C  -3.629724 -0.112729 -0.097237
C  -3.570849 -1.571723 0.110037
C  -1.97778 1.705196 -0.783471
C  -4.819794 0.712876 0.037537
C  -6.014394 0.337442 0.506129
C  -7.181113 1.25665 0.609162
H  3.455662 0.317994 -1.165366
H  1.860664 -0.381437 1.388947
H  2.230211 2.5266 2.32408
H  3.252825 1.121096 2.587896
H  3.929298 2.57778 1.862356
H  2.127372 2.288419 -1.433533
H  1.349742 3.064987 -0.052912
H  3.049175 3.363917 -0.398611
H  4.333433 -0.60586 1.667453
H  -1.181262 -0.968026 -1.65177
H  6.784125 -2.641981 0.473317
H  7.57646 -1.132168 0.864544
H  6.295838 -1.746233 1.914717
H  5.277305 -0.150189 -1.972043
H  6.963005 -0.324951 -1.496576
H  6.016852 -1.746928 -1.873003
H  -1.758389 -2.253841 0.9838
H  -2.047068 -2.916522 -0.622942
H  -1.579821 1.754818 -1.799161
H  -1.174432 2.027957 -0.116468
H  -2.784794 2.428347 -0.697613
H  -4.70957 1.745924 -0.278551
H  -6.180379 -0.678174 0.841491
H  -7.529865 1.328449 1.641977
H  -6.946351 2.26126 0.257931
H  -8.026061 0.880135 0.028011
elementType: O C H
totalener: -965.42594499 hartree
nucrepener: 1757.92666973 hartree
electener: -2723.35261472 hartree
oneelecener: -4802.19686872 hartree
twoeener: 2078.84425399 hartree
cpcmener: -0.03362846 hartree
kineticenergy: 960.99559811 hartree
xcener: -95.147158840392 hartree
chargesum: 0.0000000
charge: -0.294817 -0.493046 -0.478830 0.110768 0.035235 -0.083186 -0.272679 -0.281352 -0.288054 0.391799 -0.049987 0.258489 -0.217871 -0.253847 -0.135965 -0.018660 -0.039952 0.298437 -0.248744 -0.241733 -0.084911 -0.217428 0.092449 0.091431 0.097630 0.089609 0.097985 0.093853 0.095830 0.101444 0.121053 0.107378 0.092922 0.094053 0.088792 0.090960 0.094812 0.098439 0.104426 0.098176 0.114635 0.110709 0.105341 0.123980 0.125814 0.095222 0.084273 0.095119
qa: -0.2948 -0.4930 -0.4788 0.1108 0.0352 -0.0832 -0.2727 -0.2814 -0.2881 0.3918 -0.0500 0.2585 -0.2179 -0.2538 -0.1360 -0.0187 -0.0400 0.2984 -0.2487 -0.2417 -0.0849 -0.2174 0.0924 0.0914 0.0976 0.0896 0.0980 0.0939 0.0958 0.1014 0.1211 0.1074 0.0929 0.0941 0.0888 0.0910 0.0948 0.0984 0.1044 0.0982 0.1146 0.1107 0.1053 0.1240 0.1258 0.0952 0.0843 0.0951
va: 2.1256 2.0031 2.0085 3.6795 3.7874 3.8239 3.9070 3.9018 3.8783 4.1737 3.7622 3.7678 3.9198 3.9405 3.9752 3.7308 3.5603 4.0247 3.9325 3.9002 3.8215 3.9593 1.0317 1.0355 1.0013 1.0064 1.0013 1.0165 1.0009 1.0016 1.0106 1.0293 0.9960 0.9964 1.0088 1.0096 0.9975 0.9960 1.0249 1.0250 1.0038 0.9993 1.0130 1.0175 1.0317 0.9955 1.0082 0.9961
dispcorr: -0.021265331 hartree
energy: -965.447210323853
dipole: 18.91921 -17.42218 1.49703 11.62033 -10.14320 1.47714 3.11616 -2.59454 0.52162
magnitude: 2.16683 au
magnitude: 5.50763 debye
