program: Orca
programVersion: 5.0.2
elementType: O O O C C C C C C C C C C C C C C C C C C C H H H H H H H H H H H H H H H H H H H H H H H H H H
charge: 0
multiplicity: 1
keywords: wb97x-d3
keywords: def2-TZVPP
keywords: def2/J RIJCOSX
keywords: DEFGRID2
keywords: scfconv7
keywords: smallprint printgap noloewdin
keywords: NOSOSCF
formula: C19H26O3
InChI: InChI=1/C19H26O3/c1-7-8-13-12(4)16(10-15(13)20)22-18(21)17-14(9-11(2)3)19(17,5)6/h7-9,14,16-17H,10H2,1-6H3
48 atoms
O  0.150398 -0.75019 -0.130484
O  0.986633 -2.812385 -0.282855
O  -4.036266 -1.457901 1.595784
C  2.658292 -0.478509 1.761845
C  2.668439 0.425509 0.574213
C  2.430807 -1.057729 0.372545
C  3.961227 -0.866719 2.416741
C  1.512271 -0.37992 2.738591
C  3.905351 1.068304 0.062482
C  1.138541 -1.633771 -0.042434
C  4.033169 1.605316 -1.153863
C  -1.148651 -1.223526 -0.499222
C  5.294911 2.294867 -1.573563
C  2.949137 1.574805 -2.186422
C  -1.870687 -1.953717 0.626217
C  -1.992102 -0.010639 -0.795931
C  -3.142944 -0.02014 -0.093035
C  -3.146858 -1.174384 0.817863
C  -1.537724 0.98821 -1.792129
C  -4.257302 0.918113 -0.116488
C  -4.7052 1.560947 -1.197328
C  -5.839787 2.524422 -1.192825
H  1.774171 1.033095 0.472812
H  3.266593 -1.63528 -0.006958
H  4.770041 -1.001773 1.699262
H  4.273851 -0.105477 3.134133
H  3.846019 -1.80511 2.96191
H  1.779011 0.302016 3.548245
H  0.596802 -0.001186 2.28817
H  1.294014 -1.350726 3.187979
H  4.748226 1.133569 0.744322
H  -1.063591 -1.840408 -1.398542
H  5.723865 1.82409 -2.461724
H  5.099787 3.33648 -1.841475
H  6.049368 2.285735 -0.787262
H  2.628997 2.58766 -2.442125
H  3.315703 1.126774 -3.112823
H  2.068526 1.015834 -1.873431
H  -1.296577 -1.950682 1.555807
H  -2.093054 -2.99371 0.385869
H  -1.768339 0.644242 -2.803841
H  -0.458611 1.136212 -1.748849
H  -2.02713 1.950921 -1.653905
H  -4.766184 1.074107 0.830887
H  -4.240803 1.376722 -2.161074
H  -6.274088 2.642578 -0.200639
H  -5.513358 3.506852 -1.541309
H  -6.627929 2.203143 -1.877104
elementType: O C H
totalener: -965.42249631 hartree
nucrepener: 1812.87815524 hartree
electener: -2778.30065155 hartree
oneelecener: -4911.62278276 hartree
twoeener: 2133.32213121 hartree
cpcmener: -0.03728606 hartree
kineticenergy: 961.00879027 hartree
xcener: -95.147107611852 hartree
chargesum: 0.0000000
charge: -0.281065 -0.496773 -0.481478 0.154899 -0.018234 -0.097849 -0.303817 -0.274082 -0.294168 0.406790 -0.020231 0.258326 -0.232200 -0.227807 -0.150450 -0.084466 0.008565 0.308714 -0.273719 -0.245443 -0.088745 -0.215447 0.106942 0.095852 0.091485 0.101056 0.099255 0.098541 0.087001 0.103352 0.127209 0.113259 0.095053 0.095170 0.089928 0.100938 0.098238 0.059984 0.109760 0.110282 0.123118 0.098302 0.113181 0.117911 0.133633 0.086878 0.095715 0.096641
qa: -0.2811 -0.4968 -0.4815 0.1549 -0.0182 -0.0978 -0.3038 -0.2741 -0.2942 0.4068 -0.0202 0.2583 -0.2322 -0.2278 -0.1505 -0.0845 0.0086 0.3087 -0.2737 -0.2454 -0.0887 -0.2154 0.1069 0.0959 0.0915 0.1011 0.0993 0.0985 0.0870 0.1034 0.1272 0.1133 0.0951 0.0952 0.0899 0.1009 0.0982 0.0600 0.1098 0.1103 0.1231 0.0983 0.1132 0.1179 0.1336 0.0869 0.0957 0.0966
va: 2.1107 2.0010 2.0150 3.7172 3.7997 3.8418 3.9139 3.8794 3.8609 4.1306 3.7167 3.7119 3.9297 3.9412 3.9155 3.8182 3.4547 4.0532 3.9638 3.8688 3.8589 3.9512 1.0159 1.0281 1.0013 0.9986 1.0018 1.0028 1.0148 0.9992 1.0021 1.0162 0.9963 0.9953 1.0065 0.9987 1.0002 1.0192 1.0206 1.0218 0.9914 1.0073 1.0006 1.0245 0.9995 1.0083 0.9967 0.9962
dispcorr: -0.023308098 hartree
energy: -965.445804410487
dipole: 13.82118 -12.51991 1.30127 16.50961 -14.26579 2.24383 -4.64664 3.11013 -1.53651
magnitude: 3.01479 au
magnitude: 7.66298 debye
