program: Orca
programVersion: 5.0.2
elementType: O O O C C C C C C C C C C C C C C C C C C C H H H H H H H H H H H H H H H H H H H H H H H H H H
charge: 0
multiplicity: 1
keywords: wb97x-d3
keywords: def2-TZVPP
keywords: def2/J RIJCOSX
keywords: DEFGRID2
keywords: scfconv7
keywords: smallprint printgap noloewdin
keywords: NOSOSCF
formula: C19H26O3
InChI: InChI=1/C19H26O3/c1-7-8-13-12(4)16(10-15(13)20)22-18(21)17-14(9-11(2)3)19(17,5)6/h7-9,14,16-17H,10H2,1-6H3
48 atoms
O  -0.039763 -0.233405 0.05348
O  0.986216 0.578759 -1.768344
O  -4.0825 -2.529403 0.131904
C  2.881296 1.858955 0.394921
C  3.531888 0.662948 -0.202463
C  2.116082 0.5418 0.340783
C  3.284875 2.296729 1.781614
C  2.496284 3.011679 -0.499397
C  4.637224 -0.076461 0.454314
C  0.99881 0.315992 -0.586586
C  4.888345 -1.367508 0.221665
C  -1.218448 -0.587149 -0.673971
C  6.039576 -2.076936 0.861465
C  4.030412 -2.17898 -0.707707
C  -1.770478 -1.912473 -0.182755
C  -2.324196 0.404487 -0.429249
C  -3.486153 -0.205669 -0.100321
C  -3.248977 -1.659734 -0.025762
C  -2.062584 1.852318 -0.606095
C  -4.760998 0.461756 0.114505
C  -5.905314 -0.08335 0.540173
C  -7.160063 0.696581 0.730232
H  3.568418 0.665445 -1.289903
H  2.013815 0.041609 1.296618
H  3.502564 1.456279 2.440473
H  4.174366 2.928571 1.740459
H  2.48708 2.880702 2.243598
H  2.304735 2.71524 -1.527642
H  1.608769 3.5228 -0.122581
H  3.308875 3.739894 -0.519851
H  5.283511 0.475034 1.130535
H  -0.99725 -0.626071 -1.743167
H  6.717546 -2.481588 0.105371
H  6.614922 -1.422855 1.516197
H  5.693663 -2.930285 1.450225
H  4.282424 -3.238303 -0.665835
H  2.968528 -2.081051 -0.471562
H  4.150831 -1.859019 -1.74566
H  -1.359348 -2.167212 0.797804
H  -1.572818 -2.749267 -0.851968
H  -2.966115 2.455093 -0.566142
H  -1.567459 2.040744 -1.559771
H  -1.388946 2.215936 0.173367
H  -4.766904 1.527751 -0.093105
H  -5.961825 -1.139213 0.772341
H  -7.027841 1.752181 0.492089
H  -7.963137 0.303457 0.102203
H  -7.515492 0.620878 1.760656
elementType: O C H
totalener: -965.42291340 hartree
nucrepener: 1777.12067532 hartree
electener: -2742.54358872 hartree
oneelecener: -4840.57839659 hartree
twoeener: 2098.03480787 hartree
cpcmener: -0.03245007 hartree
kineticenergy: 960.99696457 hartree
xcener: -95.145927523082 hartree
chargesum: -0.0000000
charge: -0.300900 -0.499952 -0.480692 0.158306 -0.024604 -0.107292 -0.288712 -0.278842 -0.300209 0.403410 0.005732 0.255674 -0.228034 -0.286998 -0.134550 -0.016387 -0.042529 0.301142 -0.244496 -0.244463 -0.085972 -0.216690 0.103580 0.095786 0.092028 0.100285 0.098347 0.092225 0.098117 0.098274 0.126931 0.104894 0.100217 0.086264 0.097414 0.100892 0.101882 0.104593 0.103837 0.098292 0.107020 0.110068 0.112712 0.123888 0.125014 0.084352 0.095146 0.094999
qa: -0.3009 -0.5000 -0.4807 0.1583 -0.0246 -0.1073 -0.2887 -0.2788 -0.3002 0.4034 0.0057 0.2557 -0.2280 -0.2870 -0.1346 -0.0164 -0.0425 0.3011 -0.2445 -0.2445 -0.0860 -0.2167 0.1036 0.0958 0.0920 0.1003 0.0983 0.0922 0.0981 0.0983 0.1269 0.1049 0.1002 0.0863 0.0974 0.1009 0.1019 0.1046 0.1038 0.0983 0.1070 0.1101 0.1127 0.1239 0.1250 0.0844 0.0951 0.0950
va: 2.1132 1.9957 2.0065 3.7154 3.8160 3.8446 3.9090 3.8842 3.8571 4.1087 3.6582 3.7802 3.9242 3.9553 3.9683 3.7347 3.5577 4.0191 3.9363 3.8972 3.8235 3.9587 1.0228 1.0314 1.0019 0.9990 1.0027 1.0179 1.0004 1.0015 1.0019 1.0307 0.9929 1.0079 0.9937 1.0061 0.9963 0.9958 1.0250 1.0250 1.0109 1.0078 0.9993 1.0174 1.0320 1.0081 0.9961 0.9957
dispcorr: -0.022008185 hartree
energy: -965.444921583301
dipole: 14.48655 -13.17676 1.30980 8.30172 -6.94583 1.35589 4.80740 -4.10785 0.69956
magnitude: 2.01082 au
magnitude: 5.11110 debye
