program: Orca
programVersion: 5.0.2
elementType: O O O C C C C C C C C C C C C C C C C C C C H H H H H H H H H H H H H H H H H H H H H H H H H H
charge: 0
multiplicity: 1
keywords: wb97x-d3
keywords: def2-TZVPP
keywords: def2/J RIJCOSX
keywords: DEFGRID2
keywords: scfconv7
keywords: smallprint printgap noloewdin
keywords: NOSOSCF
formula: C19H26O3
InChI: InChI=1/C19H26O3/c1-7-8-13-12(4)16(10-15(13)20)22-18(21)17-14(9-11(2)3)19(17,5)6/h7-9,14,16-17H,10H2,1-6H3
48 atoms
O  -0.059867 -0.327754 0.05578
O  0.956724 0.507411 -1.760044
O  -4.170602 -2.491896 0.156023
C  2.812415 1.809813 0.424721
C  3.492472 0.650549 -0.213541
C  2.090957 0.469529 0.345142
C  3.225107 2.227006 1.815212
C  2.368113 2.970798 -0.43116
C  4.636439 -0.05833 0.415009
C  0.971426 0.240014 -0.57911
C  4.95572 -1.334281 0.182221
C  -1.247298 -0.650357 -0.673525
C  6.145556 -1.973306 0.828924
C  4.170341 -2.225068 -0.729502
C  -1.841478 -1.954122 -0.174381
C  -2.3214 0.37873 -0.437186
C  -3.499543 -0.190461 -0.093857
C  -3.309801 -1.651188 -0.01078
C  -2.022142 1.814936 -0.646894
C  -4.754017 0.515331 0.120019
C  -5.90329 0.001182 0.569995
C  -7.143877 0.802175 0.760941
H  3.515924 0.687988 -1.299679
H  2.013317 -0.058935 1.288151
H  3.475738 1.379213 2.452439
H  4.096515 2.883511 1.773831
H  2.419808 2.779457 2.302195
H  2.198846 2.700967 -1.470992
H  1.450445 3.416423 -0.042197
H  3.137248 3.745148 -0.419443
H  5.263589 0.516951 1.089957
H  -1.023148 -0.705351 -1.741258
H  6.684191 -1.2806 1.475066
H  5.846047 -2.835137 1.430669
H  6.844974 -2.350498 0.078476
H  3.265351 -1.759007 -1.115056
H  4.778037 -2.531711 -1.584496
H  3.881762 -3.144438 -0.214647
H  -1.433585 -2.224137 0.803225
H  -1.678545 -2.796819 -0.84539
H  -1.654968 1.981834 -1.661687
H  -1.233102 2.150502 0.030384
H  -2.885865 2.455683 -0.48836
H  -4.737882 1.57614 -0.111401
H  -5.974448 -1.048759 0.823039
H  -7.48203 0.755047 1.798766
H  -7.004312 1.849925 0.494937
H  -7.961557 0.402398 0.156541
elementType: O C H
totalener: -965.42442812 hartree
nucrepener: 1776.32272901 hartree
electener: -2741.74715713 hartree
oneelecener: -4838.99847725 hartree
twoeener: 2097.25132012 hartree
cpcmener: -0.03236515 hartree
kineticenergy: 960.99818577 hartree
xcener: -95.146904118929 hartree
chargesum: -0.0000000
charge: -0.297926 -0.500547 -0.479681 0.159687 -0.036887 -0.087915 -0.291140 -0.280109 -0.292615 0.394889 -0.012157 0.259554 -0.227820 -0.245982 -0.134811 -0.021445 -0.041061 0.300512 -0.243671 -0.242666 -0.085551 -0.217018 0.104491 0.092216 0.092884 0.100268 0.098160 0.093488 0.097457 0.098880 0.125472 0.106076 0.089890 0.095496 0.095309 0.079773 0.103182 0.096251 0.104155 0.098254 0.113579 0.110300 0.104515 0.124598 0.124981 0.095017 0.084469 0.095200
qa: -0.2979 -0.5005 -0.4797 0.1597 -0.0369 -0.0879 -0.2911 -0.2801 -0.2926 0.3949 -0.0122 0.2596 -0.2278 -0.2460 -0.1348 -0.0214 -0.0411 0.3005 -0.2437 -0.2427 -0.0856 -0.2170 0.1045 0.0922 0.0929 0.1003 0.0982 0.0935 0.0975 0.0989 0.1255 0.1061 0.0899 0.0955 0.0953 0.0798 0.1032 0.0963 0.1042 0.0983 0.1136 0.1103 0.1045 0.1246 0.1250 0.0950 0.0845 0.0952
va: 2.1210 1.9916 2.0073 3.6931 3.8353 3.8204 3.9107 3.8841 3.8807 4.1324 3.7033 3.7704 3.9279 3.9415 3.9712 3.7402 3.5590 4.0212 3.9364 3.8977 3.8228 3.9595 1.0247 1.0327 1.0014 0.9988 1.0025 1.0167 1.0006 1.0021 1.0027 1.0301 1.0064 0.9967 0.9957 1.0145 0.9982 0.9991 1.0249 1.0251 1.0039 1.0003 1.0120 1.0170 1.0317 0.9956 1.0082 0.9960
dispcorr: -0.021946308 hartree
energy: -965.446374426363
dipole: 14.97967 -13.63910 1.34056 8.48780 -7.16800 1.31980 4.83604 -4.15035 0.68569
magnitude: 2.00229 au
magnitude: 5.08940 debye
