program: Orca
programVersion: 5.0.2
elementType: O O O C C C C C C C C C C C C C C C C C C C H H H H H H H H H H H H H H H H H H H H H H H H H H
charge: 0
multiplicity: 1
keywords: wb97x-d3
keywords: def2-TZVPP
keywords: def2/J RIJCOSX
keywords: DEFGRID2
keywords: scfconv7
keywords: smallprint printgap noloewdin
keywords: NOSOSCF
formula: C19H26O3
InChI: InChI=1/C19H26O3/c1-7-8-13-12(4)16(10-15(13)20)22-18(21)17-14(9-11(2)3)19(17,5)6/h7-9,14,16-17H,10H2,1-6H3
48 atoms
O  -0.167227 -1.21356 1.216409
O  -0.053739 0.727402 0.111445
O  -4.43852 0.85143 1.421949
C  2.808948 0.798948 1.443457
C  2.926024 0.399268 0.004246
C  1.946721 -0.330516 0.903066
C  3.891532 0.389716 2.412232
C  2.19862 2.138394 1.772887
C  4.086292 -0.350686 -0.523278
C  0.497858 -0.18104 0.689093
C  4.885347 0.025533 -1.526616
C  -1.591263 -1.262745 1.122092
C  6.012598 -0.852781 -1.979618
C  4.758185 1.314073 -2.278963
C  -2.34964 -0.237056 1.951445
C  -2.142228 -1.121326 -0.269296
C  -3.25672 -0.355569 -0.292897
C  -3.491884 0.181016 1.055866
C  -1.521204 -1.834344 -1.413693
C  -4.085031 -0.131436 -1.467133
C  -5.14412 0.678315 -1.572247
C  -5.942868 0.829953 -2.81995
H  2.461639 1.096912 -0.685284
H  2.248121 -1.320467 1.227293
H  4.278519 -0.60945 2.217401
H  4.729214 1.08784 2.358978
H  3.514274 0.404128 3.436205
H  1.667027 2.103427 2.725865
H  2.989851 2.884491 1.865942
H  1.507131 2.494969 1.013036
H  4.294974 -1.302814 -0.043474
H  -1.820282 -2.272376 1.472306
H  6.974213 -0.343987 -1.875159
H  6.060825 -1.784597 -1.41698
H  5.910654 -1.102628 -3.038765
H  3.943722 1.946745 -1.933357
H  5.681489 1.892138 -2.19548
H  4.609964 1.127869 -3.344973
H  -1.744381 0.639767 2.190836
H  -2.721343 -0.638808 2.89392
H  -0.962111 -1.134636 -2.039091
H  -2.269925 -2.302534 -2.052651
H  -0.827726 -2.60566 -1.08321
H  -3.796611 -0.696403 -2.349567
H  -5.469185 1.270888 -0.72655
H  -5.943767 1.86782 -3.16068
H  -5.564181 0.205694 -3.629079
H  -6.988681 0.565914 -2.646666
elementType: O C H
totalener: -965.42256580 hartree
nucrepener: 1790.53531078 hartree
electener: -2755.95787658 hartree
oneelecener: -4868.06791522 hartree
twoeener: 2112.11003865 hartree
cpcmener: -0.03617159 hartree
kineticenergy: 961.00287400 hartree
xcener: -95.149564203600 hartree
chargesum: -0.0000000
charge: -0.306561 -0.494427 -0.490152 0.123889 0.035614 -0.133393 -0.265886 -0.284245 -0.290394 0.429160 -0.040019 0.300532 -0.223301 -0.253542 -0.151741 0.000211 -0.077261 0.297338 -0.283071 -0.240260 -0.091571 -0.217049 0.094622 0.089055 0.090031 0.097280 0.098181 0.100377 0.097397 0.091664 0.122859 0.122256 0.093933 0.089386 0.094439 0.090765 0.096352 0.096868 0.113617 0.106189 0.123692 0.119822 0.109937 0.120136 0.123141 0.094687 0.084921 0.094520
qa: -0.3066 -0.4944 -0.4902 0.1239 0.0356 -0.1334 -0.2659 -0.2842 -0.2904 0.4292 -0.0400 0.3005 -0.2233 -0.2535 -0.1517 0.0002 -0.0773 0.2973 -0.2831 -0.2403 -0.0916 -0.2170 0.0946 0.0891 0.0900 0.0973 0.0982 0.1004 0.0974 0.0917 0.1229 0.1223 0.0939 0.0894 0.0944 0.0908 0.0964 0.0969 0.1136 0.1062 0.1237 0.1198 0.1099 0.1201 0.1231 0.0947 0.0849 0.0945
va: 2.1368 2.0154 1.9987 3.6805 3.7636 3.8892 3.9041 3.9044 3.8695 4.1213 3.7380 3.7543 3.9216 3.9437 3.9445 3.6585 3.5790 4.0108 3.9398 3.9011 3.8319 3.9583 1.0305 1.0416 1.0045 1.0022 1.0024 0.9991 1.0005 1.0190 1.0085 0.9908 0.9965 1.0087 0.9956 1.0089 0.9971 0.9969 1.0228 1.0247 0.9952 0.9966 1.0081 1.0140 1.0335 0.9957 1.0082 0.9960
dispcorr: -0.021751223 hartree
energy: -965.444317020384
dipole: 21.10184 -18.87597 2.22588 2.41480 -4.16878 -1.75398 -10.07618 9.55171 -0.52447
magnitude: 2.88202 au
magnitude: 7.32551 debye
