program: Orca
programVersion: 5.0.2
elementType: O O O C C C C C C C C C C C C C C C C C C C H H H H H H H H H H H H H H H H H H H H H H H H H H
charge: 0
multiplicity: 1
keywords: wb97x-d3
keywords: def2-TZVPP
keywords: def2/J RIJCOSX
keywords: DEFGRID2
keywords: scfconv7
keywords: smallprint printgap noloewdin
keywords: NOSOSCF
formula: C19H26O3
InChI: InChI=1/C19H26O3/c1-7-8-13-12(4)16(10-15(13)20)22-18(21)17-14(9-11(2)3)19(17,5)6/h7-9,14,16-17H,10H2,1-6H3
48 atoms
O  -0.130004 0.612964 -0.251401
O  1.097285 0.275081 -2.086313
O  -3.640514 -2.314917 -0.922186
C  3.2609 1.759024 -0.294984
C  3.556623 0.303205 -0.401814
C  2.16586 0.741999 0.00635
C  3.761271 2.524556 0.905712
C  3.20578 2.594946 -1.549218
C  4.431014 -0.402238 0.570793
C  1.03084 0.522411 -0.902109
C  4.229697 -1.640726 1.028936
C  -1.330999 0.400786 -0.999687
C  5.182168 -2.277236 1.993997
C  3.059561 -2.489552 0.637299
C  -1.614495 -1.061246 -1.300915
C  -2.478993 0.856104 -0.143169
C  -3.438205 -0.089189 -0.027753
C  -3.003855 -1.293677 -0.758506
C  -2.463957 2.22859 0.413849
C  -4.700333 0.072475 0.677819
C  -5.62947 -0.860207 0.911393
C  -6.893883 -0.58929 1.649932
H  3.611903 -0.066435 -1.423453
H  1.920794 0.644762 1.057901
H  3.135333 3.399756 1.087965
H  3.762173 1.923263 1.814729
H  4.780488 2.878182 0.737374
H  2.924091 2.027125 -2.433321
H  2.502174 3.422023 -1.438204
H  4.189864 3.026875 -1.741774
H  5.314781 0.133316 0.906917
H  -1.301651 1.0051 -1.911293
H  5.610772 -3.191424 1.57554
H  6.002246 -1.611926 2.262772
H  4.668717 -2.570671 2.91313
H  2.435547 -2.709653 1.507445
H  2.427772 -2.032455 -0.122019
H  3.398294 -3.454371 0.252297
H  -0.916564 -1.725882 -0.785025
H  -1.569676 -1.301998 -2.362944
H  -3.406038 2.510866 0.877477
H  -2.236931 2.951611 -0.372973
H  -1.679257 2.330853 1.167062
H  -4.892589 1.071916 1.056826
H  -5.49168 -1.876781 0.565916
H  -7.763713 -0.810582 1.027117
H  -6.977847 -1.232525 2.529051
H  -6.965425 0.447492 1.978052
elementType: O C H
totalener: -965.42498204 hartree
nucrepener: 1779.89387190 hartree
electener: -2745.31885394 hartree
oneelecener: -4846.25550979 hartree
twoeener: 2100.93665585 hartree
cpcmener: -0.03358728 hartree
kineticenergy: 961.00560981 hartree
xcener: -95.146801173801 hartree
chargesum: 0.0000000
charge: -0.298490 -0.503986 -0.479816 0.145493 -0.014425 -0.094121 -0.286121 -0.278919 -0.300737 0.399433 -0.017640 0.261131 -0.229500 -0.238238 -0.139628 -0.047229 -0.021896 0.302246 -0.255166 -0.239640 -0.084517 -0.217281 0.102832 0.095837 0.098286 0.093306 0.099813 0.091450 0.100823 0.097662 0.125096 0.109065 0.096623 0.090258 0.094817 0.100422 0.080413 0.101819 0.108196 0.103394 0.101414 0.113077 0.109360 0.125129 0.125188 0.095138 0.095314 0.084317
qa: -0.2985 -0.5040 -0.4798 0.1455 -0.0144 -0.0941 -0.2861 -0.2789 -0.3007 0.3994 -0.0176 0.2611 -0.2295 -0.2382 -0.1396 -0.0472 -0.0219 0.3022 -0.2552 -0.2396 -0.0845 -0.2173 0.1028 0.0958 0.0983 0.0933 0.0998 0.0914 0.1008 0.0977 0.1251 0.1091 0.0966 0.0903 0.0948 0.1004 0.0804 0.1018 0.1082 0.1034 0.1014 0.1131 0.1094 0.1251 0.1252 0.0951 0.0953 0.0843
va: 2.1260 1.9966 2.0108 3.7009 3.8148 3.8267 3.9083 3.8946 3.8898 4.1142 3.7104 3.7630 3.9303 3.9349 3.9596 3.7620 3.5582 4.0244 3.9547 3.8890 3.8209 3.9591 1.0268 1.0297 1.0029 1.0020 0.9998 1.0172 0.9991 1.0010 1.0028 1.0163 0.9960 1.0061 0.9965 0.9984 1.0135 0.9999 1.0206 1.0247 1.0097 0.9980 1.0028 1.0150 1.0327 0.9962 0.9958 1.0082
dispcorr: -0.021713505 hartree
energy: -965.446695544686
dipole: 12.70722 -11.92875 0.77847 5.00619 -3.03804 1.96815 11.00920 -9.47538 1.53382
magnitude: 2.61386 au
magnitude: 6.64390 debye
