program: Orca
programVersion: 5.0.2
elementType: O O O C C C C C C C C C C C C C C C C C C C H H H H H H H H H H H H H H H H H H H H H H H H H H
charge: 0
multiplicity: 1
keywords: wb97x-d3
keywords: def2-TZVPP
keywords: def2/J RIJCOSX
keywords: DEFGRID2
keywords: scfconv7
keywords: smallprint printgap noloewdin
keywords: NOSOSCF
formula: C19H26O3
InChI: InChI=1/C19H26O3/c1-7-8-13-12(4)16(10-15(13)20)22-18(21)17-14(9-11(2)3)19(17,5)6/h7-9,14,16-17H,10H2,1-6H3
48 atoms
O  -0.311691 -0.536912 0.093178
O  0.857054 0.030675 -1.735835
O  -4.400981 -2.710319 0.259336
C  2.604934 1.478974 0.47543
C  3.300593 0.264259 -0.05938
C  1.869774 0.1488 0.427341
C  2.946965 1.984331 1.855641
C  2.252884 2.586001 -0.48672
C  4.371931 -0.441555 0.67037
C  0.78703 -0.108927 -0.536465
C  5.541832 -0.800805 0.133751
C  -1.473773 -0.902767 -0.659288
C  6.570595 -1.538104 0.933755
C  5.907054 -0.503559 -1.296976
C  -2.063572 -2.204813 -0.14335
C  -2.558199 0.125838 -0.473998
C  -3.721733 -0.441949 -0.092734
C  -3.527626 -1.894789 0.037941
C  -2.283933 1.552149 -0.766931
C  -5.031699 0.157135 0.121406
C  -5.263884 1.391039 0.576632
C  -6.621954 1.973455 0.760602
H  3.401019 0.258176 -1.14013
H  1.727714 -0.319259 1.394977
H  3.845871 2.603173 1.822212
H  2.135698 2.600969 2.246812
H  3.122012 1.180531 2.569542
H  2.100084 2.239395 -1.506053
H  1.350103 3.111067 -0.168257
H  3.064201 3.315465 -0.51141
H  4.178666 -0.689421 1.709724
H  -1.220696 -0.975213 -1.719084
H  6.818148 -2.494074 0.46467
H  7.504459 -0.972622 0.988027
H  6.236371 -1.7382 1.951627
H  5.800519 0.55503 -1.538003
H  6.939832 -0.781405 -1.505167
H  5.278844 -1.054857 -2.000098
H  -1.640084 -2.47599 0.827035
H  -1.911846 -3.049122 -0.815608
H  -1.893906 2.062929 0.117013
H  -3.186924 2.081111 -1.071047
H  -1.536689 1.656092 -1.55367
H  -5.882254 -0.482667 -0.098616
H  -4.430367 2.028593 0.854207
H  -7.409169 1.265726 0.501855
H  -6.773876 2.294649 1.793243
H  -6.748131 2.864335 0.140802
elementType: O C H
totalener: -965.42383862 hartree
nucrepener: 1760.48863945 hartree
electener: -2725.91247807 hartree
oneelecener: -4807.20340310 hartree
twoeener: 2081.29092503 hartree
cpcmener: -0.03467593 hartree
kineticenergy: 961.00024290 hartree
xcener: -95.145531879640 hartree
chargesum: -0.0000000
charge: -0.294081 -0.496576 -0.482440 0.115133 0.046957 -0.126595 -0.269849 -0.279088 -0.314097 0.423854 -0.011223 0.249519 -0.221147 -0.283735 -0.135757 -0.026558 -0.006030 0.304404 -0.292953 -0.254605 -0.083477 -0.215297 0.092533 0.092075 0.097672 0.097734 0.089491 0.091324 0.097578 0.098812 0.122485 0.105323 0.098319 0.096418 0.085701 0.103738 0.096141 0.103047 0.104686 0.100159 0.125748 0.119446 0.108852 0.112967 0.133805 0.087075 0.096554 0.095958
qa: -0.2941 -0.4966 -0.4824 0.1151 0.0470 -0.1266 -0.2698 -0.2791 -0.3141 0.4239 -0.0112 0.2495 -0.2211 -0.2837 -0.1358 -0.0266 -0.0060 0.3044 -0.2930 -0.2546 -0.0835 -0.2153 0.0925 0.0921 0.0977 0.0977 0.0895 0.0913 0.0976 0.0988 0.1225 0.1053 0.0983 0.0964 0.0857 0.1037 0.0961 0.1030 0.1047 0.1002 0.1257 0.1194 0.1089 0.1130 0.1338 0.0871 0.0966 0.0960
va: 2.1239 2.0018 2.0109 3.6884 3.7587 3.8856 3.9088 3.9068 3.8909 4.1410 3.6929 3.7642 3.9194 3.9409 3.9405 3.7353 3.4706 4.0393 3.9341 3.8896 3.8525 3.9508 1.0292 1.0370 1.0014 1.0023 1.0054 1.0176 1.0003 1.0009 1.0087 1.0318 0.9925 0.9931 1.0099 0.9957 1.0045 0.9966 1.0258 1.0255 0.9918 0.9990 1.0155 1.0282 0.9985 1.0081 0.9962 0.9970
dispcorr: -0.021369810 hartree
energy: -965.445208425121
dipole: 19.30604 -17.85258 1.45346 14.29246 -12.36751 1.92495 3.55103 -2.99631 0.55472
magnitude: 2.47502 au
magnitude: 6.29099 debye
