program: Gaussian 09
title: 000072893
version: EM64L-G09RevD.01
frameworkgroup: C1[X(C10H13NO)]
method: RPBEPBE
basis: SDD
operation: Freq
keyword: #p
keyword: freq=noraman
keyword: PBEPBE/SDD
title: #p freq=noraman PBEPBE/SDD
converged: NO YES NO NO
title: Mulliken charges:
elementType: O N C C C C C C C C C C H H H H H H H H H H H H H
charge: -0.259799 -0.437563 0.507527 -0.535613 0.477842 -0.391501 -0.403253 -0.447262 -0.351804 -0.670694 0.208533 -0.800571 0.206442 0.210323 0.231355 0.231489 0.213449 0.306263 0.223833 0.215448 0.220061 0.305877 0.237077 0.268564 0.233974
chargesum: 0.00000
title: Mulliken charges with hydrogens summed into heavy atoms:
elementType: O N C C C C C C C C C C
charge: -0.259799 -0.131686 0.507527 -0.118848 0.477842 -0.160145 -0.171764 -0.233813 -0.045541 -0.011352 0.208533 -0.060956
polarizability: 1.85174244e+02 -7.16344535e-01 1.16127970e+02 4.39860861e+00 2.27931033e+00 6.58277451e+01
1716.lowfreq: -86.4504 -16.5671 -0.0002 0.0005 0.0006 5.2758 6.8145 20.2404 58.9696
frequency: -86.4430 12.3849 58.8799 69.6650 128.9123 144.2543 214.6360 235.2766 300.7424 310.0839 377.2764 406.4069 409.3033 488.0812 544.6813 582.4576 612.6235 634.4116 638.6217 734.1015 750.5192 784.2980 825.8860 829.0231 863.7385 929.2566 944.6328 967.4422 985.4705 990.3255 1010.5219 1029.1714 1046.2405 1063.2748 1129.1289 1189.4046 1216.8911 1220.1471 1243.4201 1261.7627 1313.1823 1315.0627 1373.6645 1377.0249 1388.6213 1408.9879 1448.4867 1468.2857 1472.4963 1473.3124 1488.8140 1499.0753 1512.1926 1594.1682 1626.3869 1633.0637 2978.8317 2986.6246 2987.4813 3037.2336 3072.5619 3077.3690 3083.9314 3102.6705 3123.2219 3133.2539 3136.8239 3195.1503 3521.2618
redmass: 1.0539 2.5654 3.7900 4.5424 3.6495 3.3030 1.2431 3.6921 2.9799 3.8562 2.7885 3.7713 3.0867 3.7352 2.5556 2.9484 4.2488 1.1838 6.1291 3.8382 3.4647 1.1767 1.6307 3.3426 1.3904 6.4328 1.3665 2.3597 1.6915 1.3303 2.5559 1.6589 1.4492 2.0371 1.2817 1.1261 3.0584 2.3630 1.2590 1.9524 1.4388 1.5212 1.3895 3.0219 1.2005 3.5918 1.1298 1.0473 1.0430 1.0678 1.0936 1.9194 2.8205 5.3961 6.0027 5.3613 1.0349 1.0599 1.0383 1.1017 1.0984 1.1000 1.1012 1.0876 1.0909 1.0959 1.0978 1.0943 1.0763
irintensity: 0.0049 1.2150 0.2703 9.0444 0.3785 5.6300 0.9569 0.1326 1.3435 0.6556 0.1772 1.4487 0.1936 12.3760 34.7724 1.5133 3.0864 62.0664 1.6819 0.0885 2.1108 2.9211 39.8369 5.9003 41.3302 7.1235 1.1599 10.3917 16.4420 3.2762 3.4527 7.9223 3.8619 20.0767 14.8123 0.7300 17.3944 21.3685 0.3833 37.6628 9.1052 50.1106 19.5378 151.8020 9.6009 39.8971 48.3796 19.5955 13.9744 1.6062 7.3445 73.2321 333.5057 41.2594 36.1645 127.6452 43.4368 41.8156 9.4382 8.6329 16.6101 63.7938 40.8079 21.0492 24.1703 16.4103 7.7975 4.5654 11.0054
temp: 298.150 k
press: 1.00000 atm
elementType: 8 7 6 6 6 6 6 6 6 6 6 6 1 1 1 1 1 1 1 1 1 1 1 1 1
symmnumber: 1
zpe: 544376.2 jmol-1
zpe.correction: 0.207342 hartree
zpe.thermalcorrener: 0.218893 hartree
zpe.thermalcorrenthalpy: 0.219837 hartree
zpe.thermalcorrgfe: 0.167931 hartree
zpe.sumelectzpe: -517.969449 hartree
zpe.sumelectthermal: -517.957898 hartree
zpe.sumelectthermalent: -517.956954 hartree
zpe.sumelectthermalfe: -518.008860 hartree
dipole: -0.2237 3.7794 0.2724
dipole: 3.7958
quadrupole: -61.5213 -69.4211 -75.5403
quadrupole: 12.0289 1.6601 0.8303
quadrupole: 7.3063 -0.5935 -6.7127 12.0289 1.6601 0.8303
hfenergy: -518.1767914 hartree
pointgroup: C01 [X(C10H13N1O1)]
dipole: -0.1195337 1.4831577 0.1269729 debye
dipolederiv: -0.6711537 -0.0527098 -0.0263838 0.5711389 -0.9485307 -0.0092585 0.0135491 -0.0444184 -0.3453531 -1.8068203 0.2537411 -0.0734822 0.4575434 -0.3997633 0.0250019 -0.088401 0.0162373 -0.326738 0.2609444 0.0622744 -0.0174369 0.0780832 -0.1144027 -0.0020708 -0.0300123 -0.0002673 -0.0995098 0.0565877 -0.0208968 0.0350902 -0.0329824 0.1499397 0.0068617 0.194037 0.020442 0.1026304 1.1483972 0.0276143 0.0762994 0.2804685 -0.0043698 0.0153775 0.1084331 -0.0044986 0.0947294 -0.037082 0.0075406 0.0240327 -0.1617562 0.0976661 0.011092 -0.0053853 0.0248395 -0.1503767 -0.0626109 -0.0244091 0.0219782 0.1064781 0.1411292 0.029799 0.0154493 0.0144702 -0.1503611 -0.2531591 -0.0265902 0.0026073 0.1478268 0.0648595 0.0230338 0.0122855 0.0158907 -0.1982606 -0.229546 0.0083587 -0.0006371 -0.19215 -0.0491886 0.0002837 -0.0126623 0.0098958 -0.1561221 -0.0383495 -0.0139871 0.0407912 -0.010986 0.0733473 0.0139847 -0.0715599 0.0035289 -0.0015198 1.7502705 -0.1572539 0.0989897 -0.9555589 1.2256214 0.0155195 0.0541971 0.0574314 0.1713693 -0.4152885 -0.1272512 -0.0444947 -0.2524946 -0.0980878 -0.0254644 -0.0443323 -0.0149404 0.0573464 -0.0351263 0.0339436 -0.0343362 0.1043174 -0.0711732 0.1248568 -0.0464392 0.0752954 0.0010197 0.000978 -0.0081877 0.0028291 -0.0787057 -0.0697172 -0.1352517 -0.0337852 -0.090898 -0.0280108 -0.0154913 0.1141436 -0.0117611 0.1129315 -0.0286614 -0.0072597 -0.0097738 -0.0050487 0.1404282 0.041916 -0.0814683 -0.0220159 -0.09046 -0.0768335 -0.0215642 -0.0203613 -0.0224959 0.1335158 0.0141124 -0.1129193 -0.0173784 -0.1002356 -0.087786 -0.0226242 -0.0219723 -0.0256464 0.1608022 0.1419249 0.0573498 0.0026422 0.0336933 0.0668448 -0.0065363 -0.003246 -0.0051718 0.1789061 0.0723543 0.1023787 -0.0498067 0.0627726 -0.0606739 0.1087569 -0.0238692 0.0646099 0.0133397 -0.2820885 -0.0560601 0.0188439 -0.0624259 0.0971845 0.0060948 0.035533 0.0058031 0.0608071 0.1065514 -0.0519343 -0.0245122 -0.0113771 -0.0720243 -0.1330513 -0.00629 -0.0809093 -0.0181182 0.1588804 0.0184811 -0.0106772 -0.042881 0.0866682 -0.0192557 -0.0143595 -0.0149803 0.2982302 0.0465975 -0.0128382 -0.0149417 -0.0546836 0.0241188 0.1053465 0.0369002 0.1112631 -0.0251007 -0.002186 0.052432 -0.0109036 0.1227577 0.0167905 0.0074833 -0.0119953 -0.0001535 0.1293377 0.0493875 0.0082481 0.0346637 -0.0313145 0.0370426 -0.1111554 -0.0259395 -0.1102786 -0.0429916 unknown
polarizability: 185.2009263|0.7217513|116.0585029|3.9594577|3.027217|65.8705302 unknown
InChI: InChI=1S/C10H13NO/c1-3-9-4-6-10(7-5-9)11-8(2)12/h4-7,11H,3H2,1-2H3
charge 0 multiplicity 1
25 atoms
O  2.994285 -1.473665 0.010134
N  2.03584 0.67049 0.079908
C  -2.176433 -0.02271 -0.318289
C  -3.678569 -0.249819 -0.41069
C  0.644051 0.387882 -0.053401
C  -1.639313 1.28268 -0.177205
C  -1.266594 -1.109879 -0.32597
C  -0.252495 1.490096 -0.046369
C  0.126191 -0.926811 -0.196186
C  -4.333183 -0.454493 0.982821
C  3.114461 -0.217039 0.104279
C  4.471889 0.472608 0.261606
H  -4.160561 0.612237 -0.910718
H  -3.886371 -1.138018 -1.037518
H  -2.314303 2.147366 -0.173947
H  -1.654103 -2.130101 -0.440237
H  0.137571 2.511706 0.056965
H  0.814621 -1.773319 -0.207129
H  -3.897559 -1.330469 1.496439
H  -5.422916 -0.615893 0.888399
H  -4.16922 0.427517 1.628106
H  2.269792 1.662373 0.169671
H  4.68506 1.13742 -0.596099
H  5.252257 -0.299934 0.310041
H  4.513803 1.078675 1.185689
