program: Orca
programVersion: 5.0.2
elementType: O O O C C C C C C C C C C C C C C C C C C C H H H H H H H H H H H H H H H H H H H H H H H H H H
charge: 0
multiplicity: 1
keywords: wb97x-d3
keywords: def2-TZVPP
keywords: def2/J RIJCOSX
keywords: DEFGRID2
keywords: scfconv7
keywords: smallprint printgap noloewdin
keywords: NOSOSCF
formula: C19H26O3
InChI: InChI=1/C19H26O3/c1-7-8-13-12(4)16(10-15(13)20)22-18(21)17-14(9-11(2)3)19(17,5)6/h7-9,14,16-17H,10H2,1-6H3
48 atoms
O  -0.377204 -0.722432 -0.020361
O  0.797609 -0.171811 -1.850908
O  -4.563564 -2.595327 0.339101
C  2.549196 1.222778 0.383214
C  3.248554 0.026805 -0.187406
C  1.830703 -0.117755 0.305846
C  2.923434 1.68649 1.768342
C  2.158654 2.352236 -0.537569
C  4.338387 -0.671249 0.539285
C  0.732228 -0.330272 -0.652936
C  5.642173 -0.522669 0.289293
C  -1.565621 -1.012021 -0.767826
C  6.674208 -1.286651 1.061019
C  6.185989 0.40022 -0.757072
C  -2.231875 -2.271842 -0.239831
C  -2.574943 0.088771 -0.565934
C  -3.749576 -0.390136 -0.108183
C  -3.651244 -1.850434 0.040654
C  -2.223755 1.485229 -0.914552
C  -4.996139 0.30383 0.186373
C  -5.098801 1.523058 0.719957
C  -6.390314 2.199073 1.022381
H  3.347618 0.04653 -1.268764
H  1.697869 -0.614243 1.261175
H  3.129943 0.85969 2.446729
H  3.816915 2.312735 1.727582
H  2.121417 2.283481 2.205527
H  2.037046 2.042255 -1.573305
H  1.227034 2.819901 -0.212224
H  2.933315 3.121021 -0.519443
H  4.040957 -1.351268 1.332496
H  -1.324341 -1.101944 -1.828658
H  7.282336 -1.904597 0.395364
H  7.365635 -0.609035 1.568206
H  6.227555 -1.938622 1.811376
H  6.870692 1.123571 -0.307385
H  6.768643 -0.152351 -1.498409
H  5.414957 0.959337 -1.284048
H  -1.770436 -2.614733 0.689045
H  -2.20031 -3.101574 -0.946103
H  -3.109096 2.091575 -1.099963
H  -1.586649 1.516146 -1.798741
H  -1.666244 1.961701 -0.104527
H  -5.90678 -0.251561 -0.021825
H  -4.198976 2.070557 0.982703
H  -7.247222 1.589108 0.738467
H  -6.469854 2.426125 2.087595
H  -6.463112 3.154626 0.499222
elementType: O C H
totalener: -965.42432258 hartree
nucrepener: 1764.80368145 hartree
electener: -2730.22800403 hartree
oneelecener: -4815.83030829 hartree
twoeener: 2085.60230426 hartree
cpcmener: -0.03463235 hartree
kineticenergy: 961.00979783 hartree
xcener: -95.146420600157 hartree
chargesum: 0.0000000
charge: -0.292579 -0.494500 -0.481612 0.154204 -0.011403 -0.128629 -0.269938 -0.299287 -0.271520 0.418167 -0.034507 0.247532 -0.230226 -0.251535 -0.136344 -0.031479 -0.001388 0.303562 -0.289343 -0.253832 -0.086161 -0.216146 0.098506 0.094524 0.092022 0.096686 0.099310 0.094333 0.100262 0.099507 0.124139 0.106967 0.094911 0.094460 0.090417 0.096884 0.099658 0.087974 0.104029 0.101038 0.118023 0.111263 0.124316 0.115128 0.132533 0.087082 0.096879 0.096113
qa: -0.2926 -0.4945 -0.4816 0.1542 -0.0114 -0.1286 -0.2699 -0.2993 -0.2715 0.4182 -0.0345 0.2475 -0.2302 -0.2515 -0.1363 -0.0315 -0.0014 0.3036 -0.2893 -0.2538 -0.0862 -0.2161 0.0985 0.0945 0.0920 0.0967 0.0993 0.0943 0.1003 0.0995 0.1241 0.1070 0.0949 0.0945 0.0904 0.0969 0.0997 0.0880 0.1040 0.1010 0.1180 0.1113 0.1243 0.1151 0.1325 0.0871 0.0969 0.0961
va: 2.1252 2.0067 2.0126 3.6561 3.7909 3.8943 3.9043 3.9018 3.8670 4.1627 3.7013 3.7597 3.9263 3.9410 3.9317 3.7335 3.4656 4.0452 3.9300 3.8811 3.8531 3.9512 1.0253 1.0368 1.0023 1.0020 1.0028 1.0160 1.0002 1.0020 1.0064 1.0308 0.9953 0.9963 1.0073 0.9973 0.9981 1.0081 1.0270 1.0246 1.0011 1.0130 0.9926 1.0259 1.0002 1.0083 0.9959 0.9972
dispcorr: -0.022024643 hartree
energy: -965.446347223197
dipole: 20.74399 -19.13520 1.60879 16.04799 -14.12729 1.92070 4.94505 -4.40496 0.54009
magnitude: 2.56300 au
magnitude: 6.51464 debye
