program: Orca
programVersion: 5.0.2
elementType: O O O C C C C C C C C C C C C C C C C C C C H H H H H H H H H H H H H H H H H H H H H H H H H H
charge: 0
multiplicity: 1
keywords: wb97x-d3
keywords: def2-TZVPP
keywords: def2/J RIJCOSX
keywords: DEFGRID2
keywords: scfconv7
keywords: smallprint printgap noloewdin
keywords: NOSOSCF
formula: C19H26O3
InChI: InChI=1/C19H26O3/c1-7-8-13-12(4)16(10-15(13)20)22-18(21)17-14(9-11(2)3)19(17,5)6/h7-9,14,16-17H,10H2,1-6H3
48 atoms
O  -0.094633 -0.305316 -0.101963
O  0.944471 0.576751 -1.884315
O  -3.924773 -2.885111 -0.034228
C  2.729537 1.888517 0.355453
C  3.43786 0.741781 -0.276635
C  2.02898 0.539124 0.246113
C  3.108952 2.295576 1.758437
C  2.290128 3.051714 -0.499379
C  4.576272 0.051317 0.383753
C  0.93556 0.295948 -0.706565
C  4.780555 -1.268638 0.378498
C  -1.244062 -0.690395 -0.864824
C  5.96553 -1.877432 1.063142
C  3.862957 -2.246303 -0.289286
C  -1.680042 -2.101123 -0.506315
C  -2.412844 0.190952 -0.510951
C  -3.489556 -0.533458 -0.141158
C  -3.149625 -1.964103 -0.200815
C  -2.296421 1.661895 -0.649157
C  -4.832597 -0.104422 0.221446
C  -5.153114 1.037929 0.834677
C  -6.545071 1.43696 1.180456
H  3.495341 0.794008 -1.36159
H  1.937769 -0.001031 1.18149
H  3.374491 1.444498 2.385145
H  3.962537 2.975944 1.740948
H  2.282189 2.818216 2.242302
H  2.132351 2.78602 -1.541912
H  1.366954 3.491992 -0.117953
H  3.055577 3.829288 -0.47627
H  5.30136 0.684556 0.888157
H  -1.028826 -0.600177 -1.931264
H  5.64915 -2.609471 1.810608
H  6.594948 -2.417172 0.351177
H  6.582755 -1.130322 1.561456
H  3.394739 -2.902908 0.448823
H  3.07201 -1.773373 -0.867822
H  4.424313 -2.89672 -0.964441
H  -1.164828 -2.46596 0.385463
H  -1.506043 -2.823303 -1.303849
H  -3.262013 2.124647 -0.8520
H  -1.606839 1.927949 -1.450304
H  -1.910665 2.111697 0.268993
H  -5.628871 -0.80529 -0.014915
H  -4.371428 1.730141 1.130588
H  -7.27154 0.67981 0.886703
H  -6.646081 1.612049 2.253599
H  -6.81433 2.375269 0.690563
elementType: O C H
totalener: -965.42363125 hartree
nucrepener: 1785.18466302 hartree
electener: -2750.60829426 hartree
oneelecener: -4856.56974855 hartree
twoeener: 2105.96145428 hartree
cpcmener: -0.03360287 hartree
kineticenergy: 961.00599192 hartree
xcener: -95.146671359246 hartree
chargesum: -0.0000000
charge: -0.296736 -0.502896 -0.482919 0.146946 -0.009959 -0.118466 -0.284068 -0.282511 -0.306865 0.418945 -0.012630 0.247282 -0.228791 -0.242974 -0.134168 -0.026922 -0.008149 0.306450 -0.294116 -0.253653 -0.083675 -0.214074 0.104500 0.097167 0.093666 0.099415 0.097925 0.092361 0.099123 0.097226 0.124484 0.105384 0.093958 0.097249 0.090342 0.101609 0.082643 0.102225 0.104097 0.100488 0.119416 0.110084 0.125076 0.112252 0.134405 0.086455 0.096524 0.095877
qa: -0.2967 -0.5029 -0.4829 0.1469 -0.0100 -0.1185 -0.2841 -0.2825 -0.3069 0.4189 -0.0126 0.2473 -0.2288 -0.2430 -0.1342 -0.0269 -0.0081 0.3064 -0.2941 -0.2537 -0.0837 -0.2141 0.1045 0.0972 0.0937 0.0994 0.0979 0.0924 0.0991 0.0972 0.1245 0.1054 0.0940 0.0972 0.0903 0.1016 0.0826 0.1022 0.1041 0.1005 0.1194 0.1101 0.1251 0.1123 0.1344 0.0865 0.0965 0.0959
va: 2.1156 1.9938 2.0105 3.6973 3.8046 3.8366 3.9057 3.8942 3.8908 4.1086 3.7053 3.7657 3.9306 3.9357 3.9369 3.7337 3.4757 4.0361 3.9372 3.8883 3.8521 3.9513 1.0257 1.0302 1.0024 0.9999 1.0027 1.0174 0.9992 1.0016 1.0034 1.0324 0.9965 0.9960 1.0059 0.9983 1.0128 0.9995 1.0263 1.0252 0.9986 1.0147 0.9921 1.0288 0.9986 1.0082 0.9960 0.9971
dispcorr: -0.022247608 hartree
energy: -965.445878856943
dipole: 14.30902 -13.13365 1.17537 10.39533 -8.72082 1.67451 7.14920 -6.30179 0.84741
magnitude: 2.21440 au
magnitude: 5.62856 debye
