program: Orca
programVersion: 5.0.2
elementType: O O O C C C C C C C C C C C C C C C C C C C H H H H H H H H H H H H H H H H H H H H H H H H H H
charge: 0
multiplicity: 1
keywords: wb97x-d3
keywords: def2-TZVPP
keywords: def2/J RIJCOSX
keywords: DEFGRID2
keywords: scfconv7
keywords: smallprint printgap noloewdin
keywords: NOSOSCF
formula: C19H26O3
InChI: InChI=1/C19H26O3/c1-7-8-13-12(4)16(10-15(13)20)22-18(21)17-14(9-11(2)3)19(17,5)6/h7-9,14,16-17H,10H2,1-6H3
48 atoms
O  -0.258509 -0.628625 0.178431
O  0.746113 0.210446 -1.641799
O  -4.40593 -2.62534 0.536504
C  2.617345 1.455795 0.569874
C  3.308936 0.316528 -0.114265
C  1.913738 0.112709 0.445064
C  3.030551 1.851432 1.96627
C  2.171014 2.632745 -0.263146
C  4.429274 -0.424904 0.498576
C  0.775068 -0.079473 -0.467222
C  5.577363 -0.766377 -0.095821
C  -1.472605 -0.896586 -0.527531
C  6.620095 -1.548377 0.645296
C  5.942499 -0.432951 -1.509898
C  -2.08976 -2.19667 -0.036402
C  -2.506208 0.165631 -0.239891
C  -3.68145 -0.381667 0.13309
C  -3.524252 -1.838845 0.251436
C  -2.181877 1.600323 -0.419169
C  -4.961902 0.254095 0.419823
C  -5.479558 1.285312 -0.250528
C  -6.792481 1.914928 0.059965
H  3.341542 0.409132 -1.19444
H  1.845639 -0.446707 1.371538
H  2.22559 2.398638 2.459999
H  3.280902 0.998101 2.594632
H  3.902287 2.507589 1.931504
H  2.003429 2.384427 -1.308546
H  1.25177 3.068703 0.134136
H  2.938406 3.408297 -0.234073
H  4.288156 -0.730214 1.53145
H  -1.276624 -0.933929 -1.601445
H  7.556341 -0.988306 0.712016
H  6.304928 -1.800777 1.657563
H  6.855548 -2.479358 0.122924
H  5.228027 0.217767 -2.009323
H  6.917071 0.059316 -1.544051
H  6.038985 -1.34318 -2.107126
H  -1.614247 -2.539697 0.885491
H  -2.024116 -3.008343 -0.760979
H  -2.942018 2.246377 0.014864
H  -2.09992 1.845122 -1.480991
H  -1.223349 1.852457 0.037766
H  -5.539813 -0.184998 1.228671
H  -4.937965 1.699144 -1.095811
H  -6.669981 2.97545 0.290717
H  -7.463454 1.863998 -0.80011
H  -7.284801 1.43728 0.906571
elementType: O C H
totalener: -965.42556311 hartree
nucrepener: 1760.61581814 hartree
electener: -2726.04138125 hartree
oneelecener: -4807.48497066 hartree
twoeener: 2081.44358941 hartree
cpcmener: -0.03555690 hartree
kineticenergy: 960.99929056 hartree
xcener: -95.146361735764 hartree
chargesum: 0.0000000
charge: -0.296123 -0.494076 -0.482095 0.110864 0.040745 -0.087252 -0.270085 -0.282996 -0.290759 0.388694 -0.045519 0.277750 -0.219095 -0.254725 -0.145318 -0.059628 0.006085 0.300209 -0.269972 -0.251251 -0.091195 -0.215827 0.092583 0.090392 0.098073 0.089394 0.097499 0.094280 0.095133 0.101362 0.121854 0.105410 0.094241 0.088723 0.093335 0.090840 0.094763 0.098762 0.104685 0.101339 0.113056 0.124555 0.109164 0.121541 0.131557 0.095762 0.096879 0.086385
qa: -0.2961 -0.4941 -0.4821 0.1109 0.0407 -0.0873 -0.2701 -0.2830 -0.2908 0.3887 -0.0455 0.2777 -0.2191 -0.2547 -0.1453 -0.0596 0.0061 0.3002 -0.2700 -0.2513 -0.0912 -0.2158 0.0926 0.0904 0.0981 0.0894 0.0975 0.0943 0.0951 0.1014 0.1219 0.1054 0.0942 0.0887 0.0933 0.0908 0.0948 0.0988 0.1047 0.1013 0.1131 0.1246 0.1092 0.1215 0.1316 0.0958 0.0969 0.0864
va: 2.1247 2.0006 2.0124 3.6770 3.7790 3.8470 3.9067 3.9024 3.8769 4.1688 3.7527 3.7234 3.9205 3.9422 3.9383 3.7960 3.4415 4.0578 3.9433 3.8659 3.8617 3.9519 1.0323 1.0369 1.0014 1.0059 1.0016 1.0167 1.0010 1.0015 1.0099 1.0295 0.9964 1.0088 0.9957 1.0093 0.9976 0.9961 1.0270 1.0238 1.0032 0.9948 1.0034 1.0206 1.0009 0.9968 0.9962 1.0083
dispcorr: -0.021461778 hartree
energy: -965.447024887362
dipole: 19.32826 -17.81243 1.51583 13.73420 -12.00065 1.73355 1.64363 -1.37705 0.26658
magnitude: 2.31819 au
magnitude: 5.89238 debye
