program: Orca
programVersion: 5.0.2
elementType: O O O C C C C C C C C C C C C C C C C C C C H H H H H H H H H H H H H H H H H H H H H H H H H H
charge: 0
multiplicity: 1
keywords: wb97x-d3
keywords: def2-TZVPP
keywords: def2/J RIJCOSX
keywords: DEFGRID2
keywords: scfconv7
keywords: smallprint printgap noloewdin
keywords: NOSOSCF
formula: C19H26O3
InChI: InChI=1/C19H26O3/c1-7-8-13-12(4)16(10-15(13)20)22-18(21)17-14(9-11(2)3)19(17,5)6/h7-9,14,16-17H,10H2,1-6H3
48 atoms
O  -0.106167 0.800311 -0.291441
O  1.063049 0.521728 -2.173596
O  -3.483179 -2.294648 -1.016631
C  3.442292 1.71167 -0.488965
C  3.49861 0.226649 -0.431065
C  2.193116 0.933891 -0.099374
C  4.062664 2.508972 0.633487
C  3.539807 2.400337 -1.82732
C  4.216838 -0.511575 0.639199
C  1.035326 0.743141 -0.982769
C  3.775535 -1.639776 1.2010
C  -1.32324 0.538447 -0.995341
C  4.545291 -2.329871 2.284155
C  2.475102 -2.286203 0.827566
C  -1.52383 -0.926438 -1.349732
C  -2.458967 0.875917 -0.068905
C  -3.35218 -0.133029 0.033481
C  -2.883921 -1.263126 -0.789478
C  -2.509778 2.217568 0.557928
C  -4.591818 -0.098742 0.795045
C  -5.394781 -1.130677 1.073365
C  -6.642854 -1.007776 1.876044
H  3.489279 -0.259084 -1.404575
H  1.942293 0.981004 0.953939
H  3.950484 2.024423 1.603338
H  5.129634 2.655272 0.454185
H  3.601602 3.495788 0.70168
H  3.194969 1.783657 -2.653764
H  2.967561 3.329915 -1.834377
H  4.582159 2.65671 -2.025956
H  5.166855 -0.100751 0.969576
H  -1.376542 1.179028 -1.881093
H  5.451929 -1.789089 2.554675
H  3.935171 -2.440323 3.184371
H  4.829746 -3.340262 1.980092
H  2.086474 -1.951926 -0.132977
H  2.581149 -3.37177 0.784512
H  1.712593 -2.079878 1.583381
H  -0.778984 -1.564516 -0.86534
H  -1.481673 -1.12714 -2.419733
H  -2.428287 2.992277 -0.207388
H  -1.667413 2.360505 1.237033
H  -3.42327 2.388672 1.121905
H  -4.872626 0.874506 1.186882
H  -5.155743 -2.125765 0.720299
H  -6.605785 -1.655814 2.754684
H  -6.817439 0.013844 2.212708
H  -7.511307 -1.329663 1.296681
elementType: O C H
totalener: -965.42437397 hartree
nucrepener: 1790.42005271 hartree
electener: -2755.84442667 hartree
oneelecener: -4867.31983956 hartree
twoeener: 2111.47541289 hartree
cpcmener: -0.03354611 hartree
kineticenergy: 961.00740068 hartree
xcener: -95.147146456548 hartree
chargesum: -0.0000000
charge: -0.301998 -0.502232 -0.479588 0.152328 -0.009895 -0.082266 -0.284209 -0.282364 -0.312734 0.381972 -0.001969 0.270025 -0.229215 -0.249173 -0.141575 -0.058877 -0.018018 0.303250 -0.251640 -0.240767 -0.083055 -0.216123 0.103392 0.093041 0.093200 0.099472 0.097958 0.091077 0.100453 0.095572 0.124561 0.109457 0.089619 0.095781 0.096484 0.083703 0.103165 0.105068 0.107697 0.103150 0.112844 0.109721 0.098672 0.125583 0.123655 0.095179 0.084508 0.095114
qa: -0.3020 -0.5022 -0.4796 0.1523 -0.0099 -0.0823 -0.2842 -0.2824 -0.3127 0.3820 -0.0020 0.2700 -0.2292 -0.2492 -0.1416 -0.0589 -0.0180 0.3032 -0.2516 -0.2408 -0.0831 -0.2161 0.1034 0.0930 0.0932 0.0995 0.0980 0.0911 0.1005 0.0956 0.1246 0.1095 0.0896 0.0958 0.0965 0.0837 0.1032 0.1051 0.1077 0.1031 0.1128 0.1097 0.0987 0.1256 0.1237 0.0952 0.0845 0.0951
va: 2.1160 1.9986 2.0097 3.6982 3.8158 3.8225 3.9091 3.8900 3.8969 4.1279 3.6918 3.7489 3.9330 3.9390 3.9501 3.7821 3.5530 4.0245 3.9565 3.8850 3.8249 3.9590 1.0243 1.0303 1.0017 0.9997 1.0029 1.0193 0.9989 1.0007 1.0033 1.0152 1.0060 0.9954 0.9961 1.0086 1.0012 0.9968 1.0205 1.0261 0.9977 1.0041 1.0098 1.0144 1.0306 0.9957 1.0082 0.9964
dispcorr: -0.022090639 hartree
energy: -965.446464607749
dipole: 11.89885 -11.16570 0.73315 3.52193 -1.68705 1.83488 11.81975 -10.10143 1.71832
magnitude: 2.61857 au
magnitude: 6.65589 debye
