program: Orca
programVersion: 5.0.2
elementType: O O O C C C C C C C C C C C C C C C C C C C H H H H H H H H H H H H H H H H H H H H H H H H H H
charge: 0
multiplicity: 1
keywords: wb97x-d3
keywords: def2-TZVPP
keywords: def2/J RIJCOSX
keywords: DEFGRID2
keywords: scfconv7
keywords: smallprint printgap noloewdin
keywords: NOSOSCF
formula: C19H26O3
InChI: InChI=1/C19H26O3/c1-7-8-13-12(4)16(10-15(13)20)22-18(21)17-14(9-11(2)3)19(17,5)6/h7-9,14,16-17H,10H2,1-6H3
48 atoms
O  -0.297474 -0.557067 0.071542
O  0.807486 0.080046 -1.774408
O  -4.379362 -2.666152 0.407278
C  2.639422 1.403718 0.44157
C  3.32035 0.209491 -0.157011
C  1.902453 0.076227 0.355143
C  3.017743 1.852966 1.831374
C  2.261967 2.548468 -0.466201
C  4.398173 -0.520727 0.543953
C  0.783762 -0.120607 -0.581648
C  5.625877 -0.765291 0.074113
C  -1.510396 -0.819794 -0.637675
C  6.621288 -1.532453 0.891455
C  6.131469 -0.318815 -1.263019
C  -2.091871 -2.159862 -0.214463
C  -2.556797 0.201814 -0.26653
C  -3.70831 -0.388448 0.11586
C  -3.521631 -1.847162 0.141165
C  -2.267978 1.649731 -0.390053
C  -4.986712 0.199936 0.492665
C  -5.522594 1.305301 -0.029718
C  -6.833273 1.875644 0.386714
H  3.40216 0.247028 -1.238285
H  1.783147 -0.431889 1.305799
H  3.207478 1.021039 2.508205
H  3.918441 2.469104 1.799413
H  2.219956 2.45712 2.267007
H  2.120421 2.249625 -1.502472
H  1.345604 3.035014 -0.125033
H  3.054781 3.298548 -0.451896
H  4.155695 -0.889307 1.536738
H  -1.329053 -0.785255 -1.714034
H  6.211787 -1.846814 1.851194
H  6.959181 -2.425451 0.359191
H  7.514938 -0.933412 1.084813
H  5.403184 0.243893 -1.843394
H  7.01567 0.312112 -1.141858
H  6.447831 -1.17637 -1.86218
H  -1.581522 -2.552046 0.668441
H  -2.035671 -2.922818 -0.990922
H  -1.251068 1.886025 -0.074334
H  -2.956771 2.252735 0.199031
H  -2.357725 1.967374 -1.43207
H  -5.550288 -0.342375 1.247227
H  -5.001076 1.834003 -0.82153
H  -6.711447 2.891957 0.768188
H  -7.515635 1.947083 -0.462875
H  -7.311634 1.276584 1.161027
elementType: O C H
totalener: -965.42521127 hartree
nucrepener: 1757.26599563 hartree
electener: -2722.69120689 hartree
oneelecener: -4800.74381770 hartree
twoeener: 2078.05261081 hartree
cpcmener: -0.03581172 hartree
kineticenergy: 960.99999332 hartree
xcener: -95.146027160834 hartree
chargesum: -0.0000000
charge: -0.297036 -0.494515 -0.482410 0.120376 0.035823 -0.106151 -0.265556 -0.283166 -0.290834 0.398281 -0.042382 0.284749 -0.221018 -0.252546 -0.149182 -0.059355 -0.001801 0.307482 -0.272778 -0.248507 -0.088142 -0.216338 0.092739 0.091194 0.089131 0.096998 0.098388 0.093421 0.095868 0.101004 0.122898 0.104502 0.089076 0.094184 0.093687 0.089732 0.096297 0.096782 0.103896 0.102077 0.105197 0.113137 0.124459 0.117822 0.132810 0.095988 0.097025 0.086690
qa: -0.2970 -0.4945 -0.4824 0.1204 0.0358 -0.1062 -0.2656 -0.2832 -0.2908 0.3983 -0.0424 0.2847 -0.2210 -0.2525 -0.1492 -0.0594 -0.0018 0.3075 -0.2728 -0.2485 -0.0881 -0.2163 0.0927 0.0912 0.0891 0.0970 0.0984 0.0934 0.0959 0.1010 0.1229 0.1045 0.0891 0.0942 0.0937 0.0897 0.0963 0.0968 0.1039 0.1021 0.1052 0.1131 0.1245 0.1178 0.1328 0.0960 0.0970 0.0867
va: 2.1222 2.0058 2.0118 3.6758 3.7756 3.8616 3.9049 3.9043 3.8718 4.1642 3.7433 3.7054 3.9210 3.9426 3.9447 3.7961 3.4511 4.0479 3.9443 3.8701 3.8599 3.9511 1.0323 1.0386 1.0049 1.0022 1.0020 1.0168 1.0009 1.0014 1.0085 1.0330 1.0085 0.9958 0.9964 1.0093 0.9972 0.9969 1.0269 1.0235 1.0074 1.0000 0.9919 1.0235 0.9996 0.9967 0.9960 1.0083
dispcorr: -0.021369212 hartree
energy: -965.446580479405
dipole: 19.47809 -18.04636 1.43173 14.17323 -12.25093 1.92230 3.07732 -2.69245 0.38487
magnitude: 2.42759 au
magnitude: 6.17044 debye
