program: Orca
programVersion: 5.0.2
elementType: O O O C C C C C C C C C C C C C C C C C C C H H H H H H H H H H H H H H H H H H H H H H H H H H
charge: 0
multiplicity: 1
keywords: wb97x-d3
keywords: def2-TZVPP
keywords: def2/J RIJCOSX
keywords: DEFGRID2
keywords: scfconv7
keywords: smallprint printgap noloewdin
keywords: NOSOSCF
formula: C19H26O3
InChI: InChI=1/C19H26O3/c1-7-8-13-12(4)16(10-15(13)20)22-18(21)17-14(9-11(2)3)19(17,5)6/h7-9,14,16-17H,10H2,1-6H3
48 atoms
O  -0.341142 -0.484665 0.038049
O  0.797386 0.001033 -1.834259
O  -4.385246 -2.692402 0.330177
C  2.708581 1.329787 0.314251
C  3.309432 0.061746 -0.21172
C  1.888443 0.048106 0.29686
C  3.115028 1.81983 1.681178
C  2.418037 2.443033 -0.660728
C  4.345823 -0.698971 0.527442
C  0.761898 -0.136879 -0.633227
C  5.64367 -0.731248 0.212351
C  -1.555905 -0.76033 -0.662284
C  6.612988 -1.563491 0.994863
C  6.243131 0.035591 -0.9264
C  -2.105469 -2.121613 -0.264885
C  -2.617968 0.229507 -0.255639
C  -3.757895 -0.393098 0.11259
C  -3.543288 -1.848355 0.093566
C  -2.360221 1.686455 -0.342315
C  -5.0462 0.158695 0.508276
C  -5.565279 1.316333 0.091147
C  -6.883509 1.849643 0.532188
H  3.396883 0.036421 -1.293831
H  1.734498 -0.395983 1.274381
H  2.363493 2.502133 2.082357
H  3.240307 1.008043 2.396831
H  4.059744 2.364286 1.626675
H  2.233321 2.0893 -1.672657
H  1.554712 3.032349 -0.344716
H  3.275758 3.117015 -0.705772
H  4.009532 -1.274708 1.385074
H  -1.39034 -0.694334 -1.739695
H  7.403343 -0.944082 1.426349
H  6.128595 -2.108685 1.804647
H  7.110826 -2.291575 0.349073
H  7.079483 0.64465 -0.574537
H  6.653502 -0.641686 -1.679881
H  5.536739 0.700571 -1.420461
H  -1.588988 -2.510187 0.616238
H  -2.025794 -2.872433 -1.050651
H  -2.965778 2.244868 0.371017
H  -2.607982 2.058359 -1.339876
H  -1.311707 1.925655 -0.165717
H  -5.630005 -0.45591 1.188255
H  -5.024279 1.923949 -0.626794
H  -7.401931 1.161127 1.199011
H  -6.759397 2.800739 1.05533
H  -7.529489 2.053326 -0.324163
elementType: O C H
totalener: -965.42420984 hartree
nucrepener: 1755.55201784 hartree
electener: -2720.97622768 hartree
oneelecener: -4797.31365898 hartree
twoeener: 2076.33743130 hartree
cpcmener: -0.03545883 hartree
kineticenergy: 961.00226954 hartree
xcener: -95.145866329306 hartree
chargesum: 0.0000000
charge: -0.299988 -0.493875 -0.483001 0.152152 -0.001580 -0.130632 -0.264766 -0.295114 -0.279530 0.414511 -0.029585 0.291765 -0.230161 -0.253309 -0.148753 -0.055457 -0.012643 0.310829 -0.281107 -0.244093 -0.087453 -0.215383 0.097123 0.092502 0.098364 0.091570 0.096251 0.093015 0.097713 0.099775 0.125124 0.103285 0.094746 0.089744 0.095127 0.095624 0.099743 0.088791 0.103234 0.101862 0.114788 0.123586 0.105437 0.115378 0.134682 0.087324 0.095875 0.096511
qa: -0.3000 -0.4939 -0.4830 0.1522 -0.0016 -0.1306 -0.2648 -0.2951 -0.2795 0.4145 -0.0296 0.2918 -0.2302 -0.2533 -0.1488 -0.0555 -0.0126 0.3108 -0.2811 -0.2441 -0.0875 -0.2154 0.0971 0.0925 0.0984 0.0916 0.0963 0.0930 0.0977 0.0998 0.1251 0.1033 0.0947 0.0897 0.0951 0.0956 0.0997 0.0888 0.1032 0.1019 0.1148 0.1236 0.1054 0.1154 0.1347 0.0873 0.0959 0.0965
va: 2.1228 2.0103 2.0107 3.6608 3.7833 3.8932 3.9033 3.9053 3.8760 4.1612 3.6984 3.6939 3.9266 3.9437 3.9486 3.7915 3.4632 4.0412 3.9454 3.8764 3.8596 3.9511 1.0255 1.0393 1.0029 1.0024 1.0026 1.0172 1.0014 1.0014 1.0065 1.0347 0.9965 1.0078 0.9947 0.9979 0.9974 1.0073 1.0267 1.0237 0.9966 0.9901 1.0097 1.0256 0.9984 1.0079 0.9966 0.9962
dispcorr: -0.021521773 hartree
energy: -965.445731617539
dipole: 19.97454 -18.52194 1.45260 14.67080 -12.61436 2.05644 3.79436 -3.32459 0.46977
magnitude: 2.56119 au
magnitude: 6.51002 debye
