program: Orca
programVersion: 5.0.2
elementType: O O O C C C C C C C C C C C C C C C C C C C H H H H H H H H H H H H H H H H H H H H H H H H H H
charge: 0
multiplicity: 1
keywords: wb97x-d3
keywords: def2-TZVPP
keywords: def2/J RIJCOSX
keywords: DEFGRID2
keywords: scfconv7
keywords: smallprint printgap noloewdin
keywords: NOSOSCF
formula: C19H26O3
InChI: InChI=1/C19H26O3/c1-7-8-13-12(4)16(10-15(13)20)22-18(21)17-14(9-11(2)3)19(17,5)6/h7,9,14,16-17H,1,8,10H2,2-6H3
48 atoms
O  0.210918 0.986251 0.490786
O  0.966591 2.206833 2.209352
O  -3.904994 1.504332 -1.441297
C  3.007449 1.323412 -0.696105
C  2.969183 -0.005152 -0.012562
C  2.543507 1.253753 0.745012
C  2.059219 1.653657 -1.823719
C  4.36944 1.950352 -0.8925
C  2.058971 -1.101259 -0.409162
C  1.177491 1.540509 1.231649
C  2.050536 -2.323588 0.129046
C  -1.153888 1.224192 0.834001
C  2.895168 -2.732974 1.298408
C  1.171156 -3.406377 -0.420533
C  -1.871003 2.050378 -0.228953
C  -1.872799 -0.099576 0.852345
C  -2.939285 -0.10622 0.042229
C  -3.042972 1.185973 -0.664079
C  -1.37605 -1.200673 1.714528
C  -3.906822 -1.213447 -0.1969
C  -3.417606 -2.278577 -1.13657
C  -2.218454 -2.347161 -1.696774
H  3.940941 -0.35427 0.322571
H  3.269167 1.612048 1.465806
H  1.091708 1.167318 -1.75017
H  1.884458 2.730183 -1.869106
H  2.506294 1.355564 -2.773683
H  4.294632 3.037162 -0.958095
H  5.049757 1.715172 -0.073175
H  4.827482 1.59013 -1.815475
H  1.391608 -0.914664 -1.242901
H  -1.201789 1.696677 1.818026
H  3.628917 -3.487952 1.005937
H  2.276635 -3.189786 2.074073
H  3.429071 -1.904328 1.757723
H  1.762443 -4.277556 -0.714239
H  0.608615 -3.076331 -1.292178
H  0.452982 -3.755271 0.326125
H  -1.225063 2.252026 -1.085531
H  -2.221959 3.014645 0.140088
H  -0.392974 -1.532013 1.371975
H  -1.252594 -0.861417 2.745377
H  -2.042395 -2.060756 1.707094
H  -4.832252 -0.792637 -0.600707
H  -4.187268 -1.684223 0.751319
H  -4.143902 -3.053683 -1.360422
H  -1.962837 -3.156606 -2.366654
H  -1.452888 -1.602729 -1.517032
totalener: -965.39935888 hartree
nucrepener: 1901.84950230 hartree
electener: -2867.24886118 hartree
oneelecener: -5089.48911783 hartree
twoeener: 2222.24025664 hartree
kineticenergy: 961.05242071 hartree
xcener: -95.144749482485 hartree
chargesum: -0.0000000
charge: -0.276634 -0.363679 -0.323936 0.127033 -0.007632 -0.122155 -0.283530 -0.241821 -0.194100 0.358257 -0.037454 0.189445 -0.253571 -0.223079 -0.153795 -0.057003 -0.077610 0.252467 -0.246280 -0.083671 -0.159003 -0.182992 0.088464 0.086339 0.072415 0.100974 0.097715 0.092998 0.071894 0.088611 0.090965 0.111179 0.097032 0.084899 0.085067 0.101289 0.073615 0.083250 0.084573 0.095175 0.091363 0.115040 0.096558 0.097324 0.086803 0.102790 0.104767 0.059647
qa: -0.2766 -0.3637 -0.3239 0.1270 -0.0076 -0.1222 -0.2835 -0.2418 -0.1941 0.3583 -0.0375 0.1894 -0.2536 -0.2231 -0.1538 -0.0570 -0.0776 0.2525 -0.2463 -0.0837 -0.1590 -0.1830 0.0885 0.0863 0.0724 0.1010 0.0977 0.0930 0.0719 0.0886 0.0910 0.1112 0.0970 0.0849 0.0851 0.1013 0.0736 0.0833 0.0846 0.0952 0.0914 0.1150 0.0966 0.0973 0.0868 0.1028 0.1048 0.0596
va: 2.0745 2.1482 2.1821 3.7588 3.7611 3.8544 3.9202 3.9057 3.8850 4.2290 3.7122 3.7396 3.9549 3.9396 3.8881 3.6487 3.4259 4.1034 3.9499 3.8592 3.9104 3.9215 1.0065 1.0282 1.0168 0.9998 1.0037 1.0040 1.0088 1.0039 1.0050 1.0357 0.9976 1.0001 1.0083 1.0017 1.0124 0.9970 1.0277 1.0273 1.0049 1.0060 1.0053 1.0226 0.9989 1.0083 1.0082 1.0273
dispcorr: -0.027248130 hartree
energy: -965.426607008625
dipole: 14.33443 -13.28877 1.04566 -14.81478 13.66881 -1.14596 -3.68708 3.91796 0.23089
magnitude: 1.56842 au
magnitude: 3.98661 debye
