program: Orca
programVersion: 5.0.2
elementType: O O O C C C C C C C C C C C C C C C C C C C H H H H H H H H H H H H H H H H H H H H H H H H H H
charge: 0
multiplicity: 1
keywords: wb97x-d3
keywords: def2-TZVPP
keywords: def2/J RIJCOSX
keywords: DEFGRID2
keywords: scfconv7
keywords: smallprint printgap noloewdin
keywords: NOSOSCF
formula: C19H26O3
InChI: InChI=1/C19H26O3/c1-7-8-13-12(4)16(10-15(13)20)22-18(21)17-14(9-11(2)3)19(17,5)6/h7,9,14,16-17H,1,8,10H2,2-6H3
48 atoms
O  -0.040558 0.253259 0.240572
O  1.286312 -0.759982 -1.256172
O  -4.335483 -0.846592 1.519551
C  3.412814 1.381288 -0.564366
C  3.513698 0.420958 0.570773
C  2.147508 0.977258 0.161033
C  3.693618 0.927254 -1.976066
C  3.86601 2.800624 -0.306137
C  3.872012 -1.005255 0.373288
C  1.128667 0.061899 -0.394075
C  3.416787 -2.019576 1.108096
C  -1.143045 -0.599677 -0.068311
C  2.430033 -1.854308 2.223301
C  3.860312 -3.427039 0.85152
C  -1.926778 -0.925845 1.196615
C  -2.130446 0.105228 -0.967344
C  -3.370722 0.082298 -0.461664
C  -3.367208 -0.5939 0.850661
C  -1.680129 0.690552 -2.256493
C  -4.632633 0.660762 -1.013601
C  -4.852371 2.038714 -0.45657
C  -5.762001 2.343907 0.457405
H  3.867396 0.847889 1.506413
H  1.736587 1.721177 0.834095
H  3.173891 1.566677 -2.6916
H  4.763219 1.014224 -2.17801
H  3.392319 -0.096694 -2.171612
H  3.357152 3.50157 -0.970113
H  3.670428 3.114681 0.720121
H  4.939096 2.896962 -0.480718
H  4.578651 -1.223018 -0.421232
H  -0.774813 -1.50243 -0.562683
H  2.117592 -0.822662 2.371613
H  2.847265 -2.215779 3.166577
H  1.533918 -2.451445 2.034646
H  4.571676 -3.487781 0.029163
H  3.007913 -4.064509 0.604857
H  4.33062 -3.861489 1.737198
H  -1.604803 -0.296931 2.029219
H  -1.829047 -1.963383 1.516762
H  -2.515248 1.012706 -2.875875
H  -1.042739 1.560558 -2.083545
H  -1.082494 -0.025687 -2.822056
H  -5.470629 0.01489 -0.744939
H  -4.591659 0.699182 -2.105018
H  -4.18038 2.80993 -0.821089
H  -5.86168 3.349956 0.841341
H  -6.432723 1.596662 0.861941
totalener: -965.40124758 hartree
nucrepener: 1828.24606535 hartree
electener: -2793.64731293 hartree
oneelecener: -4942.73431637 hartree
twoeener: 2149.08700345 hartree
kineticenergy: 961.04454908 hartree
xcener: -95.138271762226 hartree
chargesum: -0.0000000
charge: -0.278898 -0.378421 -0.328180 0.137763 -0.049701 -0.116739 -0.280641 -0.243031 -0.197384 0.321343 0.006577 0.228252 -0.257389 -0.206468 -0.139516 -0.074754 -0.033500 0.224397 -0.251042 -0.130065 -0.148457 -0.194369 0.097844 0.086748 0.083010 0.088291 0.110220 0.089653 0.071923 0.088590 0.084993 0.098563 0.085507 0.101086 0.084304 0.078521 0.086774 0.084041 0.089178 0.084503 0.092178 0.100469 0.117293 0.093246 0.098259 0.104331 0.099468 0.091227
qa: -0.2789 -0.3784 -0.3282 0.1378 -0.0497 -0.1167 -0.2806 -0.2430 -0.1974 0.3213 0.0066 0.2283 -0.2574 -0.2065 -0.1395 -0.0748 -0.0335 0.2244 -0.2510 -0.1301 -0.1485 -0.1944 0.0978 0.0867 0.0830 0.0883 0.1102 0.0897 0.0719 0.0886 0.0850 0.0986 0.0855 0.1011 0.0843 0.0785 0.0868 0.0840 0.0892 0.0845 0.0922 0.1005 0.1173 0.0932 0.0983 0.1043 0.0995 0.0912
va: 2.0984 2.1004 2.1712 3.7344 3.8927 3.8187 3.9085 3.9052 3.9126 4.1635 3.7370 3.7589 3.9469 3.9403 3.8677 3.7596 3.4045 4.1401 3.9432 3.8853 3.8406 3.9753 1.0047 1.0326 1.0058 0.9982 1.0174 1.0051 1.0075 1.0049 1.0120 1.0295 1.0098 1.0011 1.0011 1.0111 0.9996 0.9982 1.0325 1.0294 1.0070 1.0003 1.0079 1.0283 1.0048 1.0091 1.0075 1.0201
dispcorr: -0.023961102 hartree
energy: -965.425208683760
dipole: 15.68276 -14.57982 1.10294 2.89104 -2.32519 0.56585 -2.28326 1.89686 -0.38640
magnitude: 1.29845 au
magnitude: 3.30039 debye
